{"text_format":"1","workbook":"xlsx","n_sheets":12,"sheets":["Introduction","Dashboard","Master sheet","Tables & graphs","Lookup","1.  All staff training","2. Induction training","3. Refresher training ","4. Specialised training","5. Monitoring and reporting","6. Non completion of training","7. Staff awareness training"],"not_rendered":{"charts":12,"images":1,"macros":1,"external_links":0,"defined_names":8,"comments":0,"pivot_tables":0},"unopened":[],"bounds":{"document_bytes":16777216,"sheet_cells":100000,"rows_first":2000,"rows_last":500,"rows_between":2000,"halvings":0,"cell_chars":16384,"cell_head_chars":4096},"cells_cut":0,"cells_raw":0,"read":"whole","date_system":"1900"}

{"sheet":"Introduction","index":0,"n_rows":6,"n_cols":2,"rows_kept":6,"cut":false,"hidden":false,"merged":[[5,1,42,15],[4,1,4,15]]}
[]
[]
[]
[]
[null,"Training and Awareness Toolkit Tracker"]
[null,"\nYou can use this Tracker to record and track your actions once you have read the toolkit. \n\nThe first tab is called ‘Dashboard’. The dashboard will update automatically when you fill in the spreadsheet.\n\nThe next tab is called ‘Master Sheet’. This shows the toolkit and records all your responses in one place.\n\nWe have suggested some columns to help you to build your own action plan and improve your compliance. However, as the spreadsheet contains formula we would not recommend altering any of the existing columns. If you do make changes, you may impact the dashboard, master sheet or general functionality. Please note that we cannot offer support for maintaining the spreadsheet.\n\nKey phrases:\n\nCurrent status – This refers to whether you are ‘fully meeting our expectation’, ‘partially meeting our expectation’, or ‘not meeting our expectation’. You can also record the status as ‘not applicable’ to your organisation. You can choose the status from a drop-down list.\n\nReasons for status – You can record the reasons why you have chosen the ‘Current status’ for this expectation.\n\nActions – You can describe what you need to do next to meet the expectation.\n\nAction Owner(s) – You can specify who is responsible for the action.\n\nAction Status – You can choose what stage the action is at from a drop-down list. \n\nDue Date – You can record when you expect to complete the action.\n\n\n\nThe Data Protection Audit Framework, including the Tracker, is available under the terms of the Open Government Licence v3.0."]

{"sheet":"Dashboard","index":1,"n_rows":0,"n_cols":0,"rows_kept":0,"cut":false,"hidden":false,"merged":[]}

{"sheet":"Master sheet","index":2,"n_rows":55,"n_cols":16,"rows_kept":55,"cut":false,"hidden":false,"merged":[[50,1,51,1],[50,2,51,2],[52,1,54,1],[52,2,54,2],[47,0,54,0],[44,1,46,1],[44,2,46,2],[44,0,46,0],[47,1,49,1],[47,2,49,2],[28,1,35,1],[28,2,35,2],[28,0,35,0],[36,1,43,1],[36,2,43,2],[36,0,43,0],[0,0,0,3],[2,1,6,1],[2,2,6,2],[7,1,10,1],[7,2,10,2],[2,0,10,0],[11,1,18,1],[11,2,18,2],[11,0,18,0],[19,1,27,1],[19,2,27,2],[19,0,27,0]]}
["Training and Awareness Tracker\nMaster Sheet"]
["Category","Number","Our expectations","Reference","Ways to meet our expectations ","Current Status","Reasons for Status","Action(s)","Action owner","Action Status","Completion date\n(DD/MM/YYYY)",{"$f":"IF(ISBLANK('1.  All staff training'!K1),\"\",'1.  All staff training'!K1)","v":""},{"$f":"IF(ISBLANK('1.  All staff training'!L1),\"\",'1.  All staff training'!L1)","v":""},{"$f":"IF(ISBLANK('1.  All staff training'!M1),\"\",'1.  All staff training'!M1)","v":""},{"$f":"IF(ISBLANK('1.  All staff training'!N1),\"\",'1.  All staff training'!N1)","v":""},{"$f":"IF(ISBLANK('1.  All staff training'!O1),\"\",'1.  All staff training'!O1)","v":""}]
["All staff training",1.1000000000000001,"There is an overarching, strategic, needs-based information governance training programme in place.","1.1.1","\tInclude national and sector-specific requirements into the training programme",{"$f":"IF(ISBLANK('1.  All staff training'!E2),\"\",'1.  All staff training'!E2)","v":""},{"$f":"IF(ISBLANK('1.  All staff training'!F2),\"\",'1.  All staff training'!F2)","v":""},{"$f":"IF(ISBLANK('1.  All staff training'!G2),\"\",'1.  All staff training'!G2)","v":""},{"$f":"IF(ISBLANK('1.  All staff training'!H2),\"\",'1.  All staff training'!H2)","v":""},{"$f":"IF(ISBLANK('1.  All staff training'!I2),\"\",'1.  All staff training'!I2)","v":""},{"$f":"IF(ISBLANK('1.  All staff training'!J2),\"\",'1.  All staff training'!J2)","v":""}]
[{"$f":"A3","v":"All staff training"},{"$f":"B3","v":1.1000000000000001},"There is an overarching, strategic, needs-based information governance training programme in place.","1.1.2","\tInclude comprehensive information about key areas of data protection, such as handling requests, data sharing, information security, personal data breaches and records management.",{"$f":"IF(ISBLANK('1.  All staff training'!E3),\"\",'1.  All staff training'!E3)","v":""},{"$f":"IF(ISBLANK('1.  All staff training'!F3),\"\",'1.  All staff training'!F3)","v":""},{"$f":"IF(ISBLANK('1.  All staff training'!G3),\"\",'1.  All staff training'!G3)","v":""},{"$f":"IF(ISBLANK('1.  All staff training'!H3),\"\",'1.  All staff training'!H3)","v":""},{"$f":"IF(ISBLANK('1.  All staff training'!I3),\"\",'1.  All staff training'!I3)","v":""},{"$f":"IF(ISBLANK('1.  All staff training'!J3),\"\",'1.  All staff training'!J3)","v":""}]
["All staff training",1.1000000000000001,"There is an overarching, strategic, needs-based information governance training programme in place.","1.1.3","\tRegularly assess the training needs of all staff groups who have access to personal information, as well as specific data handling and security management responsibilities. This includes voluntary, temporary and contract staff. ",{"$f":"IF(ISBLANK('1.  All staff training'!E4),\"\",'1.  All staff training'!E4)","v":""},{"$f":"IF(ISBLANK('1.  All staff training'!F4),\"\",'1.  All staff training'!F4)","v":""},{"$f":"IF(ISBLANK('1.  All staff training'!G4),\"\",'1.  All staff training'!G4)","v":""},{"$f":"IF(ISBLANK('1.  All staff training'!H4),\"\",'1.  All staff training'!H4)","v":""},{"$f":"IF(ISBLANK('1.  All staff training'!I4),\"\",'1.  All staff training'!I4)","v":""},{"$f":"IF(ISBLANK('1.  All staff training'!J4),\"\",'1.  All staff training'!J4)","v":""}]
["All staff training",1.1000000000000001,"There is an overarching, strategic, needs-based information governance training programme in place.","1.1.4","\tProduce a training needs analysis document.",{"$f":"IF(ISBLANK('1.  All staff training'!E5),\"\",'1.  All staff training'!E5)","v":""},{"$f":"IF(ISBLANK('1.  All staff training'!F5),\"\",'1.  All staff training'!F5)","v":""},{"$f":"IF(ISBLANK('1.  All staff training'!G5),\"\",'1.  All staff training'!G5)","v":""},{"$f":"IF(ISBLANK('1.  All staff training'!H5),\"\",'1.  All staff training'!H5)","v":""},{"$f":"IF(ISBLANK('1.  All staff training'!I5),\"\",'1.  All staff training'!I5)","v":""},{"$f":"IF(ISBLANK('1.  All staff training'!J5),\"\",'1.  All staff training'!J5)","v":""}]
["All staff training",1.1000000000000001,"There is an overarching, strategic, needs-based information governance training programme in place.","1.1.5","\tEnsure delivery timescales for training programmes and strategies meet the training needs of staff. ",{"$f":"IF(ISBLANK('1.  All staff training'!E6),\"\",'1.  All staff training'!E6)","v":""},{"$f":"IF(ISBLANK('1.  All staff training'!F6),\"\",'1.  All staff training'!F6)","v":""},{"$f":"IF(ISBLANK('1.  All staff training'!G6),\"\",'1.  All staff training'!G6)","v":""},{"$f":"IF(ISBLANK('1.  All staff training'!H6),\"\",'1.  All staff training'!H6)","v":""},{"$f":"IF(ISBLANK('1.  All staff training'!I6),\"\",'1.  All staff training'!I6)","v":""},{"$f":"IF(ISBLANK('1.  All staff training'!J6),\"\",'1.  All staff training'!J6)","v":""}]
["All staff training",1.2,"There is support from senior level staff to provide an information governance training programme that is effectively resourced.","1.2.1","\tSign off information governance training programme content at senior management level.",{"$f":"IF(ISBLANK('1.  All staff training'!E7),\"\",'1.  All staff training'!E7)","v":""},{"$f":"IF(ISBLANK('1.  All staff training'!F7),\"\",'1.  All staff training'!F7)","v":""},{"$f":"IF(ISBLANK('1.  All staff training'!G7),\"\",'1.  All staff training'!G7)","v":""},{"$f":"IF(ISBLANK('1.  All staff training'!H7),\"\",'1.  All staff training'!H7)","v":""},{"$f":"IF(ISBLANK('1.  All staff training'!I7),\"\",'1.  All staff training'!I7)","v":""},{"$f":"IF(ISBLANK('1.  All staff training'!J7),\"\",'1.  All staff training'!J7)","v":""}]
{"$rows_left_out":48}
{"sheet":"Tables & graphs","index":3,"n_rows":27,"n_cols":9,"rows_kept":27,"cut":false,"hidden":true,"merged":[]}
[null,"1. All staff training","2. Induction training","3. Refresher training","4. Specialised training","5. Monitoring and reporting","6. Non-completion of training","7. Staff awareness","Total"]
["Fully meeting our expectation",{"$f":"COUNTIF('1.  All staff training'!E:E,A2)","v":0},{"$f":"COUNTIF('2. Induction training'!E:E,A2)","v":0},{"$f":"COUNTIF('3. Refresher training '!E:E,A2)","v":0},{"$f":"COUNTIF('4. Specialised training'!E:E,A2)","v":0},{"$f":"COUNTIF('5. Monitoring and reporting'!E:E,A2)","v":0},{"$f":"COUNTIF('6. Non completion of training'!E:E,A2)","v":0},{"$f":"COUNTIF('7. Staff awareness training'!E:E,A2)","v":0},{"$f":"SUM(B2:H2)","v":0}]
["Partially meeting our expectation",{"$f":"COUNTIF('1.  All staff training'!E:E,A3)","v":0},{"$f":"COUNTIF('2. Induction training'!E:E,A3)","v":0},{"$f":"COUNTIF('3. Refresher training '!E:E,A3)","v":0},{"$f":"COUNTIF('4. Specialised training'!E:E,A3)","v":0},{"$f":"COUNTIF('5. Monitoring and reporting'!E:E,A3)","v":0},{"$f":"COUNTIF('6. Non completion of training'!E:E,A3)","v":0},{"$f":"COUNTIF('7. Staff awareness training'!E:E,A3)","v":0},{"$f":"SUM(B3:H3)","v":0}]
["Not meeting our expectation",{"$f":"COUNTIF('1.  All staff training'!E:E,A4)","v":0},{"$f":"COUNTIF('2. Induction training'!E:E,A4)","v":0},{"$f":"COUNTIF('3. Refresher training '!E:E,A4)","v":0},{"$f":"COUNTIF('4. Specialised training'!E:E,A4)","v":0},{"$f":"COUNTIF('5. Monitoring and reporting'!E:E,A4)","v":0},{"$f":"COUNTIF('6. Non completion of training'!E:E,A4)","v":0},{"$f":"COUNTIF('7. Staff awareness training'!E:E,A4)","v":0},{"$f":"SUM(B4:H4)","v":0}]
["Not Applicable",{"$f":"COUNTIF('1.  All staff training'!E:E,A5)","v":0},{"$f":"COUNTIF('2. Induction training'!E:E,A5)","v":0},{"$f":"COUNTIF('3. Refresher training '!E:E,A5)","v":0},{"$f":"COUNTIF('4. Specialised training'!E:E,A5)","v":0},{"$f":"COUNTIF('5. Monitoring and reporting'!E:E,A5)","v":0},{"$f":"COUNTIF('6. Non completion of training'!E:E,A5)","v":0},{"$f":"COUNTIF('7. Staff awareness training'!E:E,A5)","v":0},{"$f":"SUM(B5:H5)","v":0}]
["Blank",{"$f":"COUNTBLANK('1.  All staff training'!E2:E10)","v":9},{"$f":"COUNTBLANK('2. Induction training'!E2:E9)","v":8},{"$f":"COUNTBLANK('3. Refresher training '!E2:E10)","v":9},{"$f":"COUNTBLANK('4. Specialised training'!E2:E9)","v":8},{"$f":"COUNTBLANK('5. Monitoring and reporting'!E2:E9)","v":8},{"$f":"COUNTBLANK('6. Non completion of training'!E2:E4)","v":3},{"$f":"COUNTBLANK('7. Staff awareness training'!E2:E9)","v":8},{"$f":"SUM(B6:H6)","v":53}]
[]
[]
{"$rows_left_out":20}
{"sheet":"Lookup","index":4,"n_rows":9,"n_cols":7,"rows_kept":9,"cut":false,"hidden":true,"merged":[]}
["Fully meeting our expectation",null,null,null,"Not started",null,"Not started"]
["Partially meeting our expectation",null,null,null,"Action rejected",null,"In progress"]
["Not meeting our expectation",null,null,null,"On track",null,"Overdue"]
["Not Applicable",null,null,null,"Overdue",null,"Completed"]
[null,null,null,null,"Completed"]
[]
[]
["2000-01-01"]
{"$rows_left_out":2}
{"sheet":"1.  All staff training","index":5,"n_rows":10,"n_cols":10,"rows_kept":10,"cut":false,"hidden":false,"merged":[[1,1,5,1],[6,1,9,1],[1,0,5,0],[6,0,9,0]]}
["Number","Our expectations","Reference","Ways to meet our expectations","Current status","Reasons for Status","Actions","Action Owner","Action Status","Due date\n(DD/MM/YYYY)"]
[1.1000000000000001,"There is an overarching, strategic, needs-based information governance training programme in place.","1.1.1","\tInclude national and sector-specific requirements into the training programme"]
[{"$f":"A2","v":1.1000000000000001},"There is an overarching, strategic, needs-based information governance training programme in place.","1.1.2","\tInclude comprehensive information about key areas of data protection, such as handling requests, data sharing, information security, personal data breaches and records management."]
[1.1000000000000001,"There is an overarching, strategic, needs-based information governance training programme in place.","1.1.3","\tRegularly assess the training needs of all staff groups who have access to personal information, as well as specific data handling and security management responsibilities. This includes voluntary, temporary and contract staff. "]
[1.1000000000000001,"There is an overarching, strategic, needs-based information governance training programme in place.","1.1.4","\tProduce a training needs analysis document."]
[1.1000000000000001,"There is an overarching, strategic, needs-based information governance training programme in place.","1.1.5","\tEnsure delivery timescales for training programmes and strategies meet the training needs of staff. "]
[1.2,"There is support from senior level staff to provide an information governance training programme that is effectively resourced.","1.2.1","\tSign off information governance training programme content at senior management level."]
[{"$f":"A7","v":1.2},"There is support from senior level staff to provide an information governance training programme that is effectively resourced.","1.2.2","\tAssign responsibility for managing and co-ordinating information governance training for all staff."]
{"$rows_left_out":3}
{"sheet":"2. Induction training","index":6,"n_rows":9,"n_cols":10,"rows_kept":9,"cut":false,"hidden":false,"merged":[[1,1,8,1],[1,0,8,0]]}
["Number","Our expectations","Reference","Ways to meet our expectations","Current Status","Reasons for Status","Actions","Action Owner","Action Status","Due Date\n(DD/MM/YYYY)"]
[2.1,"The induction training is sufficiently comprehensive, effective, kept up-to-date and delivered within an appropriate timeframe. ","2.1.1","\tInclude key areas of data protection in the induction programme, such as handling requests, data sharing, information security, personal data breaches and records management. "]
[null,null,"2.1.2","\tAssign responsibility for overseeing and approving induction training to the Data Protection Officer (DPO), information governance manager or equivalent."]
[null,null,"2.1.3","\tRequire all grades, including senior managers, to complete induction training."]
[null,null,"2.1.4","\tDeliver induction training to all staff including voluntary, temporary and contract staff."]
[null,null,"2.1.5","\tEnsure staff have completed the induction training before being permitted to process personal information. "]
[null,null,"2.1.6","\tProvide alternative induction training to non-computer based staff, if the induction training is primarily computer based."]
[null,null,"2.1.7","\tPeriodically review induction training material to ensure it remains up-to-date."]
{"$rows_left_out":2}
{"sheet":"3. Refresher training ","index":7,"n_rows":10,"n_cols":10,"rows_kept":10,"cut":false,"hidden":false,"merged":[[1,1,9,1],[1,0,9,0]]}
["Number","Our expectations","Reference","Ways to meet our expectations","Current status","Reasons fo Status","Actions","Action Owner","Action Status","Due Date\n(DD/MM/YYYY)"]
[3.1,"Refresher training is sufficiently comprehensive, effective, kept up-to-date and delivered at appropriate intervals.","3.1.1","\tInclude key areas of data protection in refresher training, such as handling requests, data sharing, information security, personal data breaches and records management."]
[null,null,"3.1.2","\tAssign the responsibility to oversee and approve refresher training to the DPO, information governance manager or equivalent."]
[null,null,"3.1.3","\tRequire staff complete refresher training at appropriate intervals."]
[null,null,"3.1.4","\tRequire all grades, including senior managers to complete refresher training."]
[null,null,"3.1.5","\tDeliver refresher training to all staff including voluntary, temporary and contract staff."]
[null,null,"3.1.6","\tProvide alternative refresher training to non-computer based staff, if the refresher training is primarily computer based."]
[null,null,"3.1.7","\tDocument when staff last received refresher training by keeping complete and up-to-date records."]
{"$rows_left_out":3}
{"sheet":"4. Specialised training","index":8,"n_rows":9,"n_cols":10,"rows_kept":9,"cut":false,"hidden":false,"merged":[[1,1,8,1],[1,0,8,0]]}
["Number","Our expectations","Reference","Ways to meet our expectations","Current status","Reasons for Status","Actions","Action owner","Action Status","Due date\n(DD/MM/YYY)"]
[4.0999999999999996,"Specific data protection training is provided to specialist roles, functions and staff that handle a large volume of personal information on a regular basis. ","4.1.1","\tComplete a training needs analysis to identify roles that require specialist information governance and data protection knowledge or expertise."]
[null,null,"4.1.2","Include wider information governance based roles in the training plan. For example, staff with responsibility for: \n- \trecords management; \n- \tinformation security; \n- \tdata sharing; \n- \thandling individual rights requests; or \n- \texemptions and disclosures."]
[null,null,"4.1.3","\tDetail training and skills requirements within role profiles."]
[null,null,"4.1.4","\tAssign responsibility to oversee, or approve procurement of, specialist training."]
[null,null,"4.1.5","\tEnsure staff in specialist information governance and data protection roles complete the specialist training before they begin work relating to their specialised role."]
[null,null,"4.1.6","\tEnsure staff who receive specialised information governance and data protection training periodically receive appropriate refresher training."]
[null,null,"4.1.7","\tDocument that staff have attended required specialist training by keeping complete and up-to-date records. Obtain certificates to evidence the completion of any specialist external training."]
{"$rows_left_out":2}
{"sheet":"5. Monitoring and reporting","index":9,"n_rows":9,"n_cols":10,"rows_kept":9,"cut":false,"hidden":false,"merged":[[1,1,8,1],[1,0,8,0]]}
["Number","Our expectations","Reference","Ways to meet our expectations","Current status","Reasons for Status","Actions","Action owner","Action Status","Due date\n(DD/MM/YYYY)"]
[5.0999999999999996,"Training completion is monitored in line with organisational requirements.","5.1.1","\tSet KPI or targets for training completion rates."]
[null,null,"5.1.2","\tProduce periodic reports to monitor all data protection training completion."]
[null,null,"5.1.3","\tDiscuss training completion reports at information governance steering groups or forums."]
[null,null,"5.1.4","\tShare training completion reports with senior management."]
[null,null,"5.1.5","\tAsk Heads of departments, or equivalent, to regularly review training completion rates for their own department. "]
[null,null,"5.1.6","\tBuild in information governance and data protection development objectives as part of personal development reviews or annual appraisal process and support staff in achieving those objectives."]
[null,null,"5.1.7","\tMonitor individual information governance and data protection related training objectives as part of the annual staff appraisal process."]
{"$rows_left_out":2}
{"sheet":"6. Non completion of training","index":10,"n_rows":4,"n_cols":10,"rows_kept":4,"cut":false,"hidden":false,"merged":[[1,0,3,0],[1,1,3,1]]}
["Number","Our expectations","Reference","Ways to meet our expectations","Current status","Reasons for Status","Actions","Action owner","Action Status","Due Date\n(DD/MM/YYYY)"]
[6.1,"There is a process to identify and follow up on non-completion or non-attendance of data protection related training.","6.1.1","\tAllocate responsibility for identifying staff who have not completed or attended data protection training, and for ensuring the staff complete it."]
[null,null,"6.1.2","\tImplement procedures to ensure that a staff member completes data protection training as soon as possible, if they have failed to do so."]
[null,null,"6.1.3","\tConsider removing access to personal information from staff who fail to undergo data protection training. "]

{"sheet":"7. Staff awareness training","index":11,"n_rows":9,"n_cols":10,"rows_kept":9,"cut":false,"hidden":false,"merged":[[1,1,3,1],[1,0,3,0],[4,1,5,1],[4,0,5,0],[6,1,8,1],[6,0,8,0]]}
["Number","Our expectations","Reference","Ways to meet our expectations","Current Status","Reasons for Status","Actions","Action owner","Action Status","Due Date\n(DD/MM/YYYY)"]
[7.1,"Various communication methods are used on a regular basis to raise staff awareness of information governance, data protection and information security, and the associated policies and procedures.","7.1.1","\tUse a variety of types of communication to raise staff awareness generally, not just in the information governance department."]
[{"$f":"A2","v":7.1},"Various communication methods are used on a regular basis to raise staff awareness of information governance, data protection and information security, and the associated policies and procedures.","7.1.2","\tPeriodically communicate information governance, data protection and information security policy updates to all staff."]
[7.1,"Various communication methods are used on a regular basis to raise staff awareness of information governance, data protection and information security, and the associated policies and procedures.","7.1.3","\tFeature information governance, data protection and information security messages in communications sent on a regular basis to staff (eg newsletters). "]
[7.2,"Staff are given the opportunity at team and department meetings to discuss information governance, data protection and information security, and associated issues. ","7.2.1","\tGive staff an opportunity to raise questions or concerns about information governance, data protection and information security at team, department, or equivalent meetings."]
[{"$f":"A5","v":7.2},"Staff are given the opportunity at team and department meetings to discuss information governance, data protection and information security, and associated issues. ","7.2.2","\tInvite information governance, data protection and information security staff to team, department, or equivalent meetings to provide more detail or focused briefings."]
[7.3,"Staff know who to contact about any information governance, data protection or information security related queries or advice. ","7.3.1","\tInclude directions in staff training material, as well as in policies and procedures, on who to contact and how. "]
[{"$f":"A7","v":7.3},"Staff know who to contact about any information governance, data protection or information security related queries or advice. ","7.3.2","\tProvide and monitor a general email inbox for information governance and data protection queries."]
{"$rows_left_out":1}