{"text_format":"1","workbook":"xlsx","n_sheets":11,"sheets":["Introduction","Dashboard","Master sheet","Tables & graphs","Lookup","1. Preparing for requests","2. Recognising requests","3. Validating & managing reque ","4. Finding & retrieving info","5. Supplying information","6. Monitoring & improving perf"],"not_rendered":{"charts":12,"images":1,"macros":1,"external_links":0,"defined_names":7,"comments":0,"pivot_tables":0},"unopened":[],"bounds":{"document_bytes":16777216,"sheet_cells":100000,"rows_first":2000,"rows_last":500,"rows_between":2000,"halvings":0,"cell_chars":16384,"cell_head_chars":4096},"cells_cut":0,"cells_raw":0,"read":"whole","date_system":"1900"}

{"sheet":"Introduction","index":0,"n_rows":6,"n_cols":2,"rows_kept":6,"cut":false,"hidden":false,"merged":[[5,1,42,15],[4,1,4,15]]}
[]
[]
[]
[]
[null,"Requests For Access Toolkit Tracker"]
[null,"\nYou can use this Tracker to record and track your actions once you have read the toolkit. \n\nThe first tab is called ‘Dashboard’. The dashboard will update automatically when you fill in the spreadsheet.\n\nThe next tab is called ‘Master Sheet’. This shows the toolkit and records all your responses in one place.\n\nWe have suggested some columns to help you to build your own action plan and improve your compliance. However, as the spreadsheet contains formula we would not recommend altering any of the existing columns. If you do make changes, you may impact the dashboard, master sheet or general functionality. Please note that we cannot offer support for maintaining the spreadsheet.\n\nKey phrases:\n\nCurrent status – This refers to whether you are ‘fully meeting our expectation’, ‘partially meeting our expectation’, or ‘not meeting our expectation’. You can also record the status as ‘not applicable’ to your organisation. You can choose the status from a drop-down list.\n\nReasons for status – You can record the reasons why you have chosen the ‘Current status’ for this expectation.\n\nActions – You can describe what you need to do next to meet the expectation.\n\nAction Owner(s) – You can specify who is responsible for the action.\n\nAction Status – You can choose what stage the action is at from a drop-down list. \n\nDue Date – You can record when you expect to complete the action.\n\n\n\nThe Data Protection Audit Framework, including the Tracker, is available under the terms of the Open Government Licence v3.0."]

{"sheet":"Dashboard","index":1,"n_rows":0,"n_cols":0,"rows_kept":0,"cut":false,"hidden":false,"merged":[]}

{"sheet":"Master sheet","index":2,"n_rows":79,"n_cols":16,"rows_kept":79,"cut":false,"hidden":false,"merged":[[72,0,78,0],[0,0,0,3],[2,1,5,1],[2,2,5,2],[6,1,10,1],[6,2,10,2],[11,1,12,1],[11,2,12,2],[13,1,14,1],[13,2,14,2],[2,0,14,0],[15,1,17,1],[15,2,17,2],[18,1,20,1],[18,2,20,2],[15,0,20,0],[39,1,40,1],[39,2,40,2],[21,0,40,0],[41,1,45,1],[41,2,45,2],[21,1,25,1],[21,2,25,2],[26,1,31,1],[26,2,31,2],[32,1,38,1],[32,2,38,2],[46,1,49,1],[46,2,49,2],[50,1,53,1],[50,2,53,2],[41,0,53,0],[54,0,71,0],[54,1,57,1],[54,2,57,2],[58,1,62,1],[58,2,62,2],[63,1,65,1],[63,2,65,2],[72,1,78,1],[72,2,78,2],[66,1,67,1],[66,2,67,2],[68,1,71,1],[68,2,71,2]]}
["Requests for Access Tracker\nMaster Sheet"]
["Category","Number","Our expectations","Reference","Ways to meet our expectations ","Current Status","Reasons for Status","Action(s)","Action owner","Action Status","Completion date\n(DD/MM/YYYY)",{"$f":"IF(ISBLANK('1. Preparing for requests'!K1),\"\",'1. Preparing for requests'!K1)","v":""},{"$f":"IF(ISBLANK('1. Preparing for requests'!L1),\"\",'1. Preparing for requests'!L1)","v":""},{"$f":"IF(ISBLANK('1. Preparing for requests'!M1),\"\",'1. Preparing for requests'!M1)","v":""},{"$f":"IF(ISBLANK('1. Preparing for requests'!N1),\"\",'1. Preparing for requests'!N1)","v":""},{"$f":"IF(ISBLANK('1. Preparing for requests'!O1),\"\",'1. Preparing for requests'!O1)","v":""}]
["Preparing for requests",1.1000000000000001,"Processes for handling requests for access to personal information are in place and outlined in policies.","1.1.1","Document how you handle requests in sufficient detail in policies, including who oversees the request process.",{"$f":"IF(ISBLANK('1. Preparing for requests'!E2),\"\",'1. Preparing for requests'!E2)","v":""},{"$f":"IF(ISBLANK('1. Preparing for requests'!F2),\"\",'1. Preparing for requests'!F2)","v":""},{"$f":"IF(ISBLANK('1. Preparing for requests'!G2),\"\",'1. Preparing for requests'!G2)","v":""},{"$f":"IF(ISBLANK('1. Preparing for requests'!H2),\"\",'1. Preparing for requests'!H2)","v":""},{"$f":"IF(ISBLANK('1. Preparing for requests'!I2),\"\",'1. Preparing for requests'!I2)","v":""},{"$f":"IF(ISBLANK('1. Preparing for requests'!J2),\"\",'1. Preparing for requests'!J2)","v":""}]
[{"$f":"A3","v":"Preparing for requests"},{"$f":"B3","v":1.1000000000000001},"Processes for handling requests for access to personal information are in place and outlined in policies.","1.1.2","Ensure these policies have appropriate document version control.",{"$f":"IF(ISBLANK('1. Preparing for requests'!E3),\"\",'1. Preparing for requests'!E3)","v":""},{"$f":"IF(ISBLANK('1. Preparing for requests'!F3),\"\",'1. Preparing for requests'!F3)","v":""},{"$f":"IF(ISBLANK('1. Preparing for requests'!G3),\"\",'1. Preparing for requests'!G3)","v":""},{"$f":"IF(ISBLANK('1. Preparing for requests'!H3),\"\",'1. Preparing for requests'!H3)","v":""},{"$f":"IF(ISBLANK('1. Preparing for requests'!I3),\"\",'1. Preparing for requests'!I3)","v":""},{"$f":"IF(ISBLANK('1. Preparing for requests'!J3),\"\",'1. Preparing for requests'!J3)","v":""}]
["Preparing for requests",1.1000000000000001,"Processes for handling requests for access to personal information are in place and outlined in policies.","1.1.3","Communicate these policies to staff dealing with requests and make policies readily available for them to refer to.",{"$f":"IF(ISBLANK('1. Preparing for requests'!E4),\"\",'1. Preparing for requests'!E4)","v":""},{"$f":"IF(ISBLANK('1. Preparing for requests'!F4),\"\",'1. Preparing for requests'!F4)","v":""},{"$f":"IF(ISBLANK('1. Preparing for requests'!G4),\"\",'1. Preparing for requests'!G4)","v":""},{"$f":"IF(ISBLANK('1. Preparing for requests'!H4),\"\",'1. Preparing for requests'!H4)","v":""},{"$f":"IF(ISBLANK('1. Preparing for requests'!I4),\"\",'1. Preparing for requests'!I4)","v":""},{"$f":"IF(ISBLANK('1. Preparing for requests'!J4),\"\",'1. Preparing for requests'!J4)","v":""}]
["Preparing for requests",1.1000000000000001,"Processes for handling requests for access to personal information are in place and outlined in policies.","1.1.4","Keep policies up-to-date, particularly with changes to data protection law.",{"$f":"IF(ISBLANK('1. Preparing for requests'!E5),\"\",'1. Preparing for requests'!E5)","v":""},{"$f":"IF(ISBLANK('1. Preparing for requests'!F5),\"\",'1. Preparing for requests'!F5)","v":""},{"$f":"IF(ISBLANK('1. Preparing for requests'!G5),\"\",'1. Preparing for requests'!G5)","v":""},{"$f":"IF(ISBLANK('1. Preparing for requests'!H5),\"\",'1. Preparing for requests'!H5)","v":""},{"$f":"IF(ISBLANK('1. Preparing for requests'!I5),\"\",'1. Preparing for requests'!I5)","v":""},{"$f":"IF(ISBLANK('1. Preparing for requests'!J5),\"\",'1. Preparing for requests'!J5)","v":""}]
["Preparing for requests",1.2000000000000002,"Staff are in place and are competent to handle requests for access.","1.2.1","Identify the specific staff member or team who manages and responds to requests.",{"$f":"IF(ISBLANK('1. Preparing for requests'!E6),\"\",'1. Preparing for requests'!E6)","v":""},{"$f":"IF(ISBLANK('1. Preparing for requests'!F6),\"\",'1. Preparing for requests'!F6)","v":""},{"$f":"IF(ISBLANK('1. Preparing for requests'!G6),\"\",'1. Preparing for requests'!G6)","v":""},{"$f":"IF(ISBLANK('1. Preparing for requests'!H6),\"\",'1. Preparing for requests'!H6)","v":""},{"$f":"IF(ISBLANK('1. Preparing for requests'!I6),\"\",'1. Preparing for requests'!I6)","v":""},{"$f":"IF(ISBLANK('1. Preparing for requests'!J6),\"\",'1. Preparing for requests'!J6)","v":""}]
["Preparing for requests",{"$f":"B7","v":1.2000000000000002},"Staff are in place and are competent to handle requests for access.","1.2.2","Assign sufficient resources to process the requests you receive.",{"$f":"IF(ISBLANK('1. Preparing for requests'!E7),\"\",'1. Preparing for requests'!E7)","v":""},{"$f":"IF(ISBLANK('1. Preparing for requests'!F7),\"\",'1. Preparing for requests'!F7)","v":""},{"$f":"IF(ISBLANK('1. Preparing for requests'!G7),\"\",'1. Preparing for requests'!G7)","v":""},{"$f":"IF(ISBLANK('1. Preparing for requests'!H7),\"\",'1. Preparing for requests'!H7)","v":""},{"$f":"IF(ISBLANK('1. Preparing for requests'!I7),\"\",'1. Preparing for requests'!I7)","v":""},{"$f":"IF(ISBLANK('1. Preparing for requests'!J7),\"\",'1. Preparing for requests'!J7)","v":""}]
["Preparing for requests",1.2000000000000002,"Staff are in place and are competent to handle requests for access.","1.2.3","Build resilience to mitigate the risk of request backlogs or failures to meet the statutory timeframes that result from staff absence.",{"$f":"IF(ISBLANK('1. Preparing for requests'!E8),\"\",'1. Preparing for requests'!E8)","v":""},{"$f":"IF(ISBLANK('1. Preparing for requests'!F8),\"\",'1. Preparing for requests'!F8)","v":""},{"$f":"IF(ISBLANK('1. Preparing for requests'!G8),\"\",'1. Preparing for requests'!G8)","v":""},{"$f":"IF(ISBLANK('1. Preparing for requests'!H8),\"\",'1. Preparing for requests'!H8)","v":""},{"$f":"IF(ISBLANK('1. Preparing for requests'!I8),\"\",'1. Preparing for requests'!I8)","v":""},{"$f":"IF(ISBLANK('1. Preparing for requests'!J8),\"\",'1. Preparing for requests'!J8)","v":""}]
["Preparing for requests",1.2000000000000002,"Staff are in place and are competent to handle requests for access.","1.2.4","Provide specialised training for staff who handle requests, particularly on statutory requirements and exemptions. ",{"$f":"IF(ISBLANK('1. Preparing for requests'!E9),\"\",'1. Preparing for requests'!E9)","v":""},{"$f":"IF(ISBLANK('1. Preparing for requests'!F9),\"\",'1. Preparing for requests'!F9)","v":""},{"$f":"IF(ISBLANK('1. Preparing for requests'!G9),\"\",'1. Preparing for requests'!G9)","v":""},{"$f":"IF(ISBLANK('1. Preparing for requests'!H9),\"\",'1. Preparing for requests'!H9)","v":""},{"$f":"IF(ISBLANK('1. Preparing for requests'!I9),\"\",'1. Preparing for requests'!I9)","v":""},{"$f":"IF(ISBLANK('1. Preparing for requests'!J9),\"\",'1. Preparing for requests'!J9)","v":""}]
{"$rows_left_out":70}
{"sheet":"Tables & graphs","index":3,"n_rows":27,"n_cols":8,"rows_kept":27,"cut":false,"hidden":true,"merged":[]}
[null,"1. Preparing for requests","2. Recognising requests","3. Validating & managing requests","4. Finding & retrieving information","5. Supplying information","6. Monitoring & improving performance","Total"]
["Fully meeting our expectation",{"$f":"COUNTIF('1. Preparing for requests'!E:E,A2)","v":0},{"$f":"COUNTIF('2. Recognising requests'!E:E,A2)","v":0},{"$f":"COUNTIF('3. Validating & managing reque '!E:E,A2)","v":0},{"$f":"COUNTIF('4. Finding & retrieving info'!E:E,A2)","v":0},{"$f":"COUNTIF('5. Supplying information'!E:E,A2)","v":0},{"$f":"COUNTIF('6. Monitoring & improving perf'!E:E,A2)","v":0},{"$f":"SUM(B2:G2)","v":0}]
["Partially meeting our expectation",{"$f":"COUNTIF('1. Preparing for requests'!E:E,A3)","v":0},{"$f":"COUNTIF('2. Recognising requests'!E:E,A3)","v":0},{"$f":"COUNTIF('3. Validating & managing reque '!E:E,A3)","v":0},{"$f":"COUNTIF('4. Finding & retrieving info'!E:E,A3)","v":0},{"$f":"COUNTIF('5. Supplying information'!E:E,A3)","v":0},{"$f":"COUNTIF('6. Monitoring & improving perf'!E:E,A3)","v":0},{"$f":"SUM(B3:G3)","v":0}]
["Not meeting our expectation",{"$f":"COUNTIF('1. Preparing for requests'!E:E,A4)","v":0},{"$f":"COUNTIF('2. Recognising requests'!E:E,A4)","v":0},{"$f":"COUNTIF('3. Validating & managing reque '!E:E,A4)","v":0},{"$f":"COUNTIF('4. Finding & retrieving info'!E:E,A4)","v":0},{"$f":"COUNTIF('5. Supplying information'!E:E,A4)","v":0},{"$f":"COUNTIF('6. Monitoring & improving perf'!E:E,A4)","v":0},{"$f":"SUM(B4:G4)","v":0}]
["Not Applicable",{"$f":"COUNTIF('1. Preparing for requests'!E:E,A5)","v":0},{"$f":"COUNTIF('2. Recognising requests'!E:E,A5)","v":0},{"$f":"COUNTIF('3. Validating & managing reque '!E:E,A5)","v":0},{"$f":"COUNTIF('4. Finding & retrieving info'!E:E,A5)","v":0},{"$f":"COUNTIF('5. Supplying information'!E:E,A5)","v":0},{"$f":"COUNTIF('6. Monitoring & improving perf'!E:E,A5)","v":0},{"$f":"SUM(B5:G5)","v":0}]
["Blank",{"$f":"COUNTBLANK('1. Preparing for requests'!E2:E14)","v":13},{"$f":"COUNTBLANK('2. Recognising requests'!E2:E7)","v":6},{"$f":"COUNTBLANK('3. Validating & managing reque '!E2:E21)","v":20},{"$f":"COUNTBLANK('4. Finding & retrieving info'!E2:E14)","v":13},{"$f":"COUNTBLANK('5. Supplying information'!E2:E19)","v":18},{"$f":"COUNTBLANK('6. Monitoring & improving perf'!E2:E8)","v":7},{"$f":"SUM(B6:G6)","v":77}]
[]
[]
[]
[]
{"$rows_left_out":18}
{"sheet":"Lookup","index":4,"n_rows":9,"n_cols":7,"rows_kept":9,"cut":false,"hidden":true,"merged":[]}
["Fully meeting our expectation",null,null,null,"Not started",null,"Not started"]
["Partially meeting our expectation",null,null,null,"Action rejected",null,"In progress"]
["Not meeting our expectation",null,null,null,"On track",null,"Overdue"]
["Not Applicable",null,null,null,"Overdue",null,"Completed"]
[null,null,null,null,"Completed"]
[]
[]
["2000-01-01"]
[{"$f":"TODAY()","v":"2024-09-17"}]

{"sheet":"1. Preparing for requests","index":5,"n_rows":14,"n_cols":10,"rows_kept":14,"cut":false,"hidden":false,"merged":[[12,1,13,1],[12,0,13,0],[1,0,4,0],[1,1,4,1],[5,0,9,0],[5,1,9,1],[10,1,11,1],[10,0,11,0]]}
["Number","Our expectations","Reference","Ways to meet our expectations","Current status","Reasons for Status","Actions","Action Owner","Action Status","Due date\n(DD/MM/YYYY)"]
[1.1000000000000001,"Processes for handling requests for access to personal information are in place and outlined in policies.","1.1.1","Document how you handle requests in sufficient detail in policies, including who oversees the request process."]
[{"$f":"A2","v":1.1000000000000001},"Processes for handling requests for access to personal information are in place and outlined in policies.","1.1.2","Ensure these policies have appropriate document version control."]
[1.1000000000000001,"Processes for handling requests for access to personal information are in place and outlined in policies.","1.1.3","Communicate these policies to staff dealing with requests and make policies readily available for them to refer to."]
[1.1000000000000001,"Processes for handling requests for access to personal information are in place and outlined in policies.","1.1.4","Keep policies up-to-date, particularly with changes to data protection law."]
[1.2000000000000002,"Staff are in place and are competent to handle requests for access.","1.2.1","Identify the specific staff member or team who manages and responds to requests."]
[{"$f":"A6","v":1.2000000000000002},"Staff are in place and are competent to handle requests for access.","1.2.2","Assign sufficient resources to process the requests you receive."]
[1.2000000000000002,"Staff are in place and are competent to handle requests for access.","1.2.3","Build resilience to mitigate the risk of request backlogs or failures to meet the statutory timeframes that result from staff absence."]
[1.2000000000000002,"Staff are in place and are competent to handle requests for access.","1.2.4","Provide specialised training for staff who handle requests, particularly on statutory requirements and exemptions. "]
[1.2000000000000002,"Staff are in place and are competent to handle requests for access.","1.2.5","Record training requirements in a training needs analysis or training programme."]
{"$rows_left_out":5}
{"sheet":"2. Recognising requests","index":6,"n_rows":7,"n_cols":10,"rows_kept":7,"cut":false,"hidden":false,"merged":[[1,12,3,12],[4,11,6,11],[4,12,6,12],[1,1,3,1],[1,0,3,0],[4,1,6,1],[4,0,6,0],[1,11,3,11]]}
["Number","Our expectations","Reference","Ways to meet our expectations","Current Status","Reasons for Status","Actions","Action Owner","Action Status","Due Date\n(DD/MM/YYYY)"]
[2.1,"Staff can recognise verbal and written (including electronic) requests for access.","2.1.1","Produce guidance for staff on how to recognise verbal, electronic and written requests."]
[{"$f":"A2","v":2.1},"Staff can recognise verbal and written (including electronic) requests for access.","2.1.2","Make guidance easily accessible and available in electronic and paper formats for staff who do not regularly work on computers."]
[2.1,"Staff can recognise verbal and written (including electronic) requests for access.","2.1.3","Train all staff on recognising requests."]
[2.2000000000000002,"Staff direct requests to the person or team who handles them.","2.2.1","Produce guidance for staff on how to direct or channel requests to the person or team who handles them."]
[{"$f":"A5","v":2.2000000000000002},"Staff direct requests to the person or team who handles them.","2.2.2","Make guidance easily accessible and available in electronic and paper formats for staff who do not regularly work on computers."]
[2.2000000000000002,"Staff direct requests to the person or team who handles them.","2.2.3","Train all staff on directing requests."]

{"sheet":"3. Validating & managing reque ","index":7,"n_rows":21,"n_cols":10,"rows_kept":21,"cut":false,"hidden":false,"merged":[[19,0,20,0],[19,1,20,1],[1,0,5,0],[1,1,5,1],[6,1,11,1],[6,0,11,0],[12,1,18,1],[12,0,18,0]]}
["Number","Our expectations","Reference","Ways to meet our expectations","Current status","Reasons fo Status","Actions","Action Owner","Action Status","Due Date\n(DD/MM/YYYY)"]
[3.1,"Processes to verify the validity of requests are in place.","3.1.1","Verify the identity of the requestor and the address to send the information to, and keep records of the verification checks."]
[{"$f":"A2","v":3.1},"Processes to verify the validity of requests are in place.","3.1.2","Verify that third parties making requests on behalf of people have written authority or power of attorney to make the request."]
[3.1,"Processes to verify the validity of requests are in place.","3.1.3","Ensure staff are aware why verification checks are important."]
[3.1,"Processes to verify the validity of requests are in place.","3.1.4","Sample or check that staff carry out verification checks appropriately on completed requests."]
[3.1,"Processes to verify the validity of requests are in place.","3.1.5","Document verification checks and how to carry them out  in sufficient detail in policies."]
[3.2,"Detailed records of requests handled are kept.","3.2.1","Keep a log of all verbal and written requests."]
[{"$f":"A7","v":3.2},"Detailed records of requests handled are kept.","3.2.2","Log who handled each request."]
[3.2,"Detailed records of requests handled are kept.","3.2.3","Log what stage each request is at."]
[3.2,"Detailed records of requests handled are kept.","3.2.4","Log the due date for a response to each request within the statutory timeframe, the actual date you responded to each request, and the reason for any delays, where you didn’t meet the statutory timeframe."]
{"$rows_left_out":12}
{"sheet":"4. Finding & retrieving info","index":8,"n_rows":14,"n_cols":10,"rows_kept":14,"cut":false,"hidden":false,"merged":[[1,1,5,1],[1,0,5,0],[6,0,9,0],[6,1,9,1],[10,1,13,1],[10,0,13,0]]}
["Number","Our expectations","Reference","Ways to meet our expectations","Current status","Reasons for Status","Actions","Action owner","Action Status","Due date\n(DD/MM/YYY)"]
[4.0999999999999996,"Processes to locate requested information in a timely manner are in place.","4.1.1","Implement a process to quickly locate relevant current paper records (that are part of a filing system)."]
[{"$f":"A2","v":4.0999999999999996},"Processes to locate requested information in a timely manner are in place.","4.1.2","Implement a process to quickly locate and retrieve paper records from archives or external storage."]
[4.0999999999999996,"Processes to locate requested information in a timely manner are in place.","4.1.3","Implement a process to quickly locate relevant current electronic records."]
[4.0999999999999996,"Processes to locate requested information in a timely manner are in place.","4.1.4","Implement a process to quickly locate and retrieve electronic records from archives, back-ups, or email storage."]
[4.0999999999999996,"Processes to locate requested information in a timely manner are in place.","4.1.5","Assign points of contact in satellite departments or buildings who can quickly retrieve paper or electronic records stored locally."]
[4.2,"Processes to properly consider whether to withhold or redact information relating to the person or a third party are in place.","4.2.1","Document how to apply exemptions, including redacting third party information, clearly in the relevant policies."]
[{"$f":"A7","v":4.2},"Processes to properly consider whether to withhold or redact information relating to the person or a third party are in place.","4.2.2","Ensure staff apply exemptions and redactions appropriately and correctly."]
[4.2,"Processes to properly consider whether to withhold or redact information relating to the person or a third party are in place.","4.2.3","Ensure a senior staff members reviews and authorises exemptions and redactions (or a sample of them)."]
[4.2,"Processes to properly consider whether to withhold or redact information relating to the person or a third party are in place.","4.2.4","Provide specialised training for staff who apply, review or authorise exemptions."]
{"$rows_left_out":5}
{"sheet":"5. Supplying information","index":9,"n_rows":19,"n_cols":10,"rows_kept":19,"cut":false,"hidden":false,"merged":[[15,0,18,0],[15,1,18,1],[5,0,9,0],[5,1,9,1],[1,1,4,1],[1,0,4,0],[10,0,12,0],[10,1,12,1],[13,0,14,0],[13,1,14,1]]}
["Number","Our expectations","Reference","Ways to meet our expectations","Current status","Reasons for Status","Actions","Action owner","Action Status","Due date\n(DD/MM/YYYY)"]
[5.0999999999999996,"Information is provided to the requestor in a suitable format.","5.1.1","Provide information in a commonly used electronic format, or another format, if requested."]
[{"$f":"A2","v":5.0999999999999996},"Information is provided to the requestor in a suitable format.","5.1.2","Ask what format the requestor prefers the information in, before fulfilling the request."]
[5.0999999999999996,"Information is provided to the requestor in a suitable format.","5.1.3","Provide information in a secure way."]
[5.0999999999999996,"Information is provided to the requestor in a suitable format.","5.1.4","Assess whether it is appropriate to provide original copies of documents containing personal information, or a transcript or extract with the personal information."]
[5.2,"Information is provided to help people understand the response.","5.2.1","Send a cover note or letter with the response, explaining clearly what searches you have completed and an overview of the information that you have provided."]
[{"$f":"A6","v":5.2},"Information is provided to help people understand the response.","5.2.2","Explain any information that people may not understand (eg codes, handwritten notes, or acronyms)."]
[5.2,"Information is provided to help people understand the response.","5.2.3","Explain the purposes of the processing."]
[5.2,"Information is provided to help people understand the response.","5.2.4","Use clear, plain, non-technical language when providing explanations."]
[5.2,"Information is provided to help people understand the response.","5.2.5","Have a clear formal process for people to complain or appeal about decisions you’ve made about their request."]
{"$rows_left_out":10}
{"sheet":"6. Monitoring & improving perf","index":10,"n_rows":8,"n_cols":10,"rows_kept":8,"cut":false,"hidden":false,"merged":[[1,1,7,1],[1,0,7,0]]}
["Number","Our expectations","Reference","Ways to meet our expectations","Current status","Reasons for Status","Actions","Action owner","Action Status","Due Date\n(DD/MM/YYYY)"]
[6.1,"Performance and compliance in handling requests is monitored. Performance and compliance information is used to improve processes.","6.1.1","Measure performance by looking at the number of requests you’ve received and the percentage you’ve completed within statutory timescales."]
[null,null,"6.1.2","Report performance to senior managers regularly for oversight."]
[null,null,"6.1.3","Regularly discuss and act on metrics or key performance indicators for requests at relevant steering groups."]
[null,null,"6.1.4","Track issues, trends, and reasons for delays in handling requests, and report insight to senior managers regularly for oversight."]
[null,null,"6.1.5","Analyse complaints or appeals about requests, and use lessons learned to improve processes and review policies."]
[null,null,"6.1.6","Monitor the number of complaints to the ICO about how you’ve handled requests."]
[null,null,"6.1.7","Keep records to show clear and sustainable improvement in your request handling processes."]