{"text_format":"1","workbook":"xlsx","n_sheets":12,"sheets":["Introduction","Dashboard","Master sheet","Tables & graphs","Lookup","1. Accountability","2. Policies and procedures","3. Training ","4. 3rd party arrangements","5. Ident, assessment & log","6. Reporting processes","7. Feedback & lessons learned"],"not_rendered":{"charts":12,"images":1,"macros":1,"external_links":0,"defined_names":8,"comments":0,"pivot_tables":0},"unopened":[],"bounds":{"document_bytes":16777216,"sheet_cells":100000,"rows_first":2000,"rows_last":500,"rows_between":2000,"halvings":0,"cell_chars":16384,"cell_head_chars":4096},"cells_cut":0,"cells_raw":0,"read":"whole","date_system":"1900"}

{"sheet":"Introduction","index":0,"n_rows":6,"n_cols":2,"rows_kept":6,"cut":false,"hidden":false,"merged":[[5,1,42,15],[4,1,4,15]]}
[]
[]
[]
[]
[null,"Personal Data Breach Management and Reporting Toolkit Tracker"]
[null,"\nYou can use this Tracker to record and track your actions once you have read the toolkit. \n\nThe first tab is called ‘Dashboard’. The dashboard will update automatically when you fill in the spreadsheet.\n\nThe next tab is called ‘Master Sheet’. This shows the toolkit and records all your responses in one place.\n\nWe have suggested some columns to help you to build your own action plan and improve your compliance. However, as the spreadsheet contains formula we would not recommend altering any of the existing columns. If you do make changes, you may impact the dashboard, master sheet or general functionality. Please note that we cannot offer support for maintaining the spreadsheet.\n\nKey phrases:\n\nCurrent status – This refers to whether you are ‘fully meeting our expectation’, ‘partially meeting our expectation’, or ‘not meeting our expectation’. You can also record the status as ‘not applicable’ to your organisation. You can choose the status from a drop-down list.\n\nReasons for status – You can record the reasons why you have chosen the ‘Current status’ for this expectation.\n\nActions – You can describe what you need to do next to meet the expectation.\n\nAction Owner(s) – You can specify who is responsible for the action.\n\nAction Status – You can choose what stage the action is at from a drop-down list. \n\nDue Date – You can record when you expect to complete the action.\n\n\n\nThe Data Protection Audit Framework, including the Tracker, is available under the terms of the Open Government Licence v3.0."]

{"sheet":"Dashboard","index":1,"n_rows":0,"n_cols":0,"rows_kept":0,"cut":false,"hidden":false,"merged":[]}

{"sheet":"Master sheet","index":2,"n_rows":76,"n_cols":16,"rows_kept":76,"cut":false,"hidden":false,"merged":[[66,1,75,1],[66,2,75,2],[66,0,75,0],[30,0,52,0],[53,1,60,1],[53,2,60,2],[61,1,65,1],[61,2,65,2],[53,0,65,0],[30,1,33,1],[30,2,33,2],[34,1,44,1],[34,2,44,2],[45,1,52,1],[45,2,52,2],[22,1,25,1],[22,2,25,2],[26,1,29,1],[26,2,29,2],[22,0,29,0],[12,1,18,1],[12,2,18,2],[19,1,21,1],[19,2,21,2],[12,0,21,0],[0,0,0,3],[2,1,5,1],[2,2,5,2],[2,0,5,0],[6,1,11,1],[6,2,11,2],[6,0,11,0]]}
["Personal Data Breach Management and Reporting Tracker\nMaster Sheet"]
["Category","Number","Our expectations","Reference","Ways to meet our expectations ","Current Status","Reasons for Status","Action(s)","Action owner","Action Status","Completion date\n(DD/MM/YYYY)",{"$f":"IF(ISBLANK('1. Accountability'!K1),\"\",'1. Accountability'!K1)","v":""},{"$f":"IF(ISBLANK('1. Accountability'!L1),\"\",'1. Accountability'!L1)","v":""},{"$f":"IF(ISBLANK('1. Accountability'!M1),\"\",'1. Accountability'!M1)","v":""},{"$f":"IF(ISBLANK('1. Accountability'!N1),\"\",'1. Accountability'!N1)","v":""},{"$f":"IF(ISBLANK('1. Accountability'!O1),\"\",'1. Accountability'!O1)","v":""}]
["Accountability",1.1000000000000001,"Nominated staff are assigned to oversee and make decisions on personal data breaches. They should be senior and experienced enough to make informed decisions.","1.1.1","\tAllocate ultimate responsibility for assessing and reporting personal data breaches at board or senior management level.",{"$f":"IF(ISBLANK('1. Accountability'!E2),\"\",'1. Accountability'!E2)","v":""},{"$f":"IF(ISBLANK('1. Accountability'!F2),\"\",'1. Accountability'!F2)","v":""},{"$f":"IF(ISBLANK('1. Accountability'!G2),\"\",'1. Accountability'!G2)","v":""},{"$f":"IF(ISBLANK('1. Accountability'!H2),\"\",'1. Accountability'!H2)","v":""},{"$f":"IF(ISBLANK('1. Accountability'!I2),\"\",'1. Accountability'!I2)","v":""},{"$f":"IF(ISBLANK('1. Accountability'!J2),\"\",'1. Accountability'!J2)","v":""}]
[{"$f":"A3","v":"Accountability"},1.1000000000000001,"Nominated staff are assigned to oversee and make decisions on personal data breaches. They should be senior and experienced enough to make informed decisions.","1.1.2","\tAllocate day-to-day management and decision-making responsibilities to oversee your response to personal data breaches, including decisions on whether to report and escalate, where appropriate.",{"$f":"IF(ISBLANK('1. Accountability'!E3),\"\",'1. Accountability'!E3)","v":""},{"$f":"IF(ISBLANK('1. Accountability'!F3),\"\",'1. Accountability'!F3)","v":""},{"$f":"IF(ISBLANK('1. Accountability'!G3),\"\",'1. Accountability'!G3)","v":""},{"$f":"IF(ISBLANK('1. Accountability'!H3),\"\",'1. Accountability'!H3)","v":""},{"$f":"IF(ISBLANK('1. Accountability'!I3),\"\",'1. Accountability'!I3)","v":""},{"$f":"IF(ISBLANK('1. Accountability'!J3),\"\",'1. Accountability'!J3)","v":""}]
["Accountability",1.1000000000000001,"Nominated staff are assigned to oversee and make decisions on personal data breaches. They should be senior and experienced enough to make informed decisions.","1.1.3","\tDesignate a person or team to document the progress and actions taken in response to personal data breaches. ",{"$f":"IF(ISBLANK('1. Accountability'!E4),\"\",'1. Accountability'!E4)","v":""},{"$f":"IF(ISBLANK('1. Accountability'!F4),\"\",'1. Accountability'!F4)","v":""},{"$f":"IF(ISBLANK('1. Accountability'!G4),\"\",'1. Accountability'!G4)","v":""},{"$f":"IF(ISBLANK('1. Accountability'!H4),\"\",'1. Accountability'!H4)","v":""},{"$f":"IF(ISBLANK('1. Accountability'!I4),\"\",'1. Accountability'!I4)","v":""},{"$f":"IF(ISBLANK('1. Accountability'!J4),\"\",'1. Accountability'!J4)","v":""}]
["Accountability",1.1000000000000001,"Nominated staff are assigned to oversee and make decisions on personal data breaches. They should be senior and experienced enough to make informed decisions.","1.1.4","\tReflect these responsibilities in the relevant job descriptions.",{"$f":"IF(ISBLANK('1. Accountability'!E5),\"\",'1. Accountability'!E5)","v":""},{"$f":"IF(ISBLANK('1. Accountability'!F5),\"\",'1. Accountability'!F5)","v":""},{"$f":"IF(ISBLANK('1. Accountability'!G5),\"\",'1. Accountability'!G5)","v":""},{"$f":"IF(ISBLANK('1. Accountability'!H5),\"\",'1. Accountability'!H5)","v":""},{"$f":"IF(ISBLANK('1. Accountability'!I5),\"\",'1. Accountability'!I5)","v":""},{"$f":"IF(ISBLANK('1. Accountability'!J5),\"\",'1. Accountability'!J5)","v":""}]
["Policies and Procedures",2.1,"There is a documented approach to managing security incidents resulting in a personal data breach that is regularly reviewed to allow the organisation to plan effectively.","2.1.1","\tHave a breach notification policy with clear guidance for staff to follow in the event of a personal data breach.",{"$f":"IF(ISBLANK('2. Policies and procedures'!E2),\"\",'2. Policies and procedures'!E2)","v":""},{"$f":"IF(ISBLANK('2. Policies and procedures'!F2),\"\",'2. Policies and procedures'!F2)","v":""},{"$f":"IF(ISBLANK('2. Policies and procedures'!G2),\"\",'2. Policies and procedures'!G2)","v":""},{"$f":"IF(ISBLANK('2. Policies and procedures'!H2),\"\",'2. Policies and procedures'!H2)","v":""},{"$f":"IF(ISBLANK('2. Policies and procedures'!I2),\"\",'2. Policies and procedures'!I2)","v":""},{"$f":"IF(ISBLANK('2. Policies and procedures'!J2),\"\",'2. Policies and procedures'!J2)","v":""}]
[{"$f":"A7","v":"Policies and Procedures"},2.1,"There is a documented approach to managing security incidents resulting in a personal data breach that is regularly reviewed to allow the organisation to plan effectively.","2.1.2","\tPut procedures in place for breach management and incident response teams to follow in the event of a personal data breach, including escalation, where appropriate.",{"$f":"IF(ISBLANK('2. Policies and procedures'!E3),\"\",'2. Policies and procedures'!E3)","v":""},{"$f":"IF(ISBLANK('2. Policies and procedures'!F3),\"\",'2. Policies and procedures'!F3)","v":""},{"$f":"IF(ISBLANK('2. Policies and procedures'!G3),\"\",'2. Policies and procedures'!G3)","v":""},{"$f":"IF(ISBLANK('2. Policies and procedures'!H3),\"\",'2. Policies and procedures'!H3)","v":""},{"$f":"IF(ISBLANK('2. Policies and procedures'!I3),\"\",'2. Policies and procedures'!I3)","v":""},{"$f":"IF(ISBLANK('2. Policies and procedures'!J3),\"\",'2. Policies and procedures'!J3)","v":""}]
{"$rows_left_out":69}
{"sheet":"Tables & graphs","index":3,"n_rows":27,"n_cols":9,"rows_kept":27,"cut":false,"hidden":true,"merged":[]}
[null,"1. Accountability","2. Policies & Procedures","3. Training","4. 3rd party arrangements","5. Identification, assessment & logs","6. Reporting process","7. Feedback & lessons learned","Total"]
["Fully meeting our expectation",{"$f":"COUNTIF('1. Accountability'!E:E,A2)","v":0},{"$f":"COUNTIF('2. Policies and procedures'!E:E,A2)","v":0},{"$f":"COUNTIF('3. Training '!E:E,A2)","v":0},{"$f":"COUNTIF('4. 3rd party arrangements'!E:E,A2)","v":0},{"$f":"COUNTIF('5. Ident, assessment & log'!E:E,A2)","v":0},{"$f":"COUNTIF('6. Reporting processes'!E:E,A2)","v":0},{"$f":"COUNTIF('7. Feedback & lessons learned'!E:E,A2)","v":0},{"$f":"SUM(B2:H2)","v":0}]
["Partially meeting our expectation",{"$f":"COUNTIF('1. Accountability'!E:E,A3)","v":0},{"$f":"COUNTIF('2. Policies and procedures'!E:E,A3)","v":0},{"$f":"COUNTIF('3. Training '!E:E,A3)","v":0},{"$f":"COUNTIF('4. 3rd party arrangements'!E:E,A3)","v":0},{"$f":"COUNTIF('5. Ident, assessment & log'!E:E,A3)","v":0},{"$f":"COUNTIF('6. Reporting processes'!E:E,A3)","v":0},{"$f":"COUNTIF('7. Feedback & lessons learned'!E:E,A3)","v":0},{"$f":"SUM(B3:H3)","v":0}]
["Not meeting our expectation",{"$f":"COUNTIF('1. Accountability'!E:E,A4)","v":0},{"$f":"COUNTIF('2. Policies and procedures'!E:E,A4)","v":0},{"$f":"COUNTIF('3. Training '!E:E,A4)","v":0},{"$f":"COUNTIF('4. 3rd party arrangements'!E:E,A4)","v":0},{"$f":"COUNTIF('5. Ident, assessment & log'!E:E,A4)","v":0},{"$f":"COUNTIF('6. Reporting processes'!E:E,A4)","v":0},{"$f":"COUNTIF('7. Feedback & lessons learned'!E:E,A4)","v":0},{"$f":"SUM(B4:H4)","v":0}]
["Not Applicable",{"$f":"COUNTIF('1. Accountability'!E:E,A5)","v":0},{"$f":"COUNTIF('2. Policies and procedures'!E:E,A5)","v":0},{"$f":"COUNTIF('3. Training '!E:E,A5)","v":0},{"$f":"COUNTIF('4. 3rd party arrangements'!E:E,A5)","v":0},{"$f":"COUNTIF('5. Ident, assessment & log'!E:E,A5)","v":0},{"$f":"COUNTIF('6. Reporting processes'!E:E,A5)","v":0},{"$f":"COUNTIF('7. Feedback & lessons learned'!E:E,A5)","v":0},{"$f":"SUM(B5:H5)","v":0}]
["Blank",{"$f":"COUNTBLANK('1. Accountability'!E2:E5)","v":4},{"$f":"COUNTBLANK('2. Policies and procedures'!E2:E7)","v":6},{"$f":"COUNTBLANK('3. Training '!E2:E11)","v":10},{"$f":"COUNTBLANK('4. 3rd party arrangements'!E2:E9)","v":8},{"$f":"COUNTBLANK('5. Ident, assessment & log'!E2:E24)","v":23},{"$f":"COUNTBLANK('6. Reporting processes'!E2:E14)","v":13},{"$f":"COUNTBLANK('7. Feedback & lessons learned'!E2:E11)","v":10},{"$f":"SUM(B6:H6)","v":74}]
[]
[]
{"$rows_left_out":20}
{"sheet":"Lookup","index":4,"n_rows":9,"n_cols":7,"rows_kept":9,"cut":false,"hidden":true,"merged":[]}
["Fully meeting our expectation",null,null,null,"Not started",null,"Not started"]
["Partially meeting our expectation",null,null,null,"Action rejected",null,"In progress"]
["Not meeting our expectation",null,null,null,"On track",null,"Overdue"]
["Not Applicable",null,null,null,"Overdue",null,"Completed"]
[null,null,null,null,"Completed"]
[]
[]
["2000-01-01"]
{"$rows_left_out":2}
{"sheet":"1. Accountability","index":5,"n_rows":5,"n_cols":10,"rows_kept":5,"cut":false,"hidden":false,"merged":[[1,1,4,1],[1,0,4,0]]}
["Number","Our expectations","Reference","Ways to meet our expectations","Current status","Reasons for Status","Actions","Action Owner","Action Status","Due date\n(DD/MM/YYYY)"]
[1.1000000000000001,"Nominated staff are assigned to oversee and make decisions on personal data breaches. They should be senior and experienced enough to make informed decisions.","1.1.1","\tAllocate ultimate responsibility for assessing and reporting personal data breaches at board or senior management level."]
[null,null,"1.1.2","\tAllocate day-to-day management and decision-making responsibilities to oversee your response to personal data breaches, including decisions on whether to report and escalate, where appropriate."]
[null,null,"1.1.3","\tDesignate a person or team to document the progress and actions taken in response to personal data breaches. "]
[null,null,"1.1.4","\tReflect these responsibilities in the relevant job descriptions."]

{"sheet":"2. Policies and procedures","index":6,"n_rows":7,"n_cols":10,"rows_kept":7,"cut":false,"hidden":false,"merged":[[1,1,6,1],[1,0,6,0]]}
["Number","Our expectations","Reference","Ways to meet our expectations","Current Status","Reasons for Status","Actions","Action Owner","Action Status","Due Date\n(DD/MM/YYYY)"]
[2.1,"There is a documented approach to managing security incidents resulting in a personal data breach that is regularly reviewed to allow the organisation to plan effectively.","2.1.1","\tHave a breach notification policy with clear guidance for staff to follow in the event of a personal data breach."]
[null,null,"2.1.2","Put procedures in place for breach management and incident response teams to follow in the event of a personal data breach, including escalation, where appropriate."]
[null,null,"2.1.3","\tMake policies and procedures readily available to all staff (eg intranet, starter packs).  "]
[null,null,"2.1.4","\tRegularly review policies and procedures, including recording the review dates, versions and change log."]
[null,null,"2.1.5","\tReview policies and procedures in light of any personal data breaches or near misses. "]
[null,null,"2.1.6","\tDocument within policies and procedures, a set of criteria to assess both the severity of the personal data breach and the likely effect on people's rights and freedoms. Include references to guidance (eg ICO guidance) and provide particular guidance on how to assess a 'high risk' to affected people."]

{"sheet":"3. Training ","index":7,"n_rows":11,"n_cols":10,"rows_kept":11,"cut":false,"hidden":false,"merged":[[1,1,7,1],[1,0,7,0],[8,1,10,1],[8,0,10,0]]}
["Number","Our expectations","Reference","Ways to meet our expectations","Current status","Reasons fo Status","Actions","Action Owner","Action Status","Due Date\n(DD/MM/YYYY)"]
[3.1,"Staff with responsibility for processing personal information are able to recognise and escalate personal data breaches.","3.1.1","\tTrain staff to recognise and report personal data breaches before they work with personal information."]
[{"$f":"A2","v":3.1},"Staff with responsibility for processing personal information are able to recognise and escalate personal data breaches.","3.1.2","\tProvide periodic staff refresher training to recognise and escalate personal data breaches."]
[3.1,"Staff with responsibility for processing personal information are able to recognise and escalate personal data breaches.","3.1.3","\tReinforce training with reminders (eg posters, newsletter sections, emails and intranet bulletins)."]
[3.1,"Staff with responsibility for processing personal information are able to recognise and escalate personal data breaches.","3.1.4","\tIncorporate anonymised examples of personal data breaches into data protection training, particularly if training is tailored to specific business areas."]
[3.1,"Staff with responsibility for processing personal information are able to recognise and escalate personal data breaches.","3.1.5","\tInclude in the training an adequate explanation of how each personal data breach occurred to raise awareness and mitigate against future occurrences of each type of incident."]
[3.1,"Staff with responsibility for processing personal information are able to recognise and escalate personal data breaches.","3.1.6","\tProvide written, easily accessible staff guidance on recognising and handling personal data breaches."]
[3.1,"Staff with responsibility for processing personal information are able to recognise and escalate personal data breaches.","3.1.7","\tImplement a culture of trust so employees feel able to report near misses."]
{"$rows_left_out":4}
{"sheet":"4. 3rd party arrangements","index":8,"n_rows":9,"n_cols":10,"rows_kept":9,"cut":false,"hidden":false,"merged":[[1,1,4,1],[1,0,4,0],[5,1,8,1],[5,0,8,0]]}
["Number","Our expectations","Reference","Ways to meet our expectations","Current status","Reasons for Status","Actions","Action owner","Action Status","Due date\n(DD/MM/YYY)"]
[4.0999999999999996,"Arrangements are in place with joint controllers in the event of a personal data breach.","4.1.1","\tIdentify any controllers who you jointly process information with. "]
[{"$f":"A2","v":4.0999999999999996},"Arrangements are in place with joint controllers in the event of a personal data breach.","4.1.2","\tDetermine with joint controllers your respective responsibilities for handling personal data breaches."]
[4.0999999999999996,"Arrangements are in place with joint controllers in the event of a personal data breach.","4.1.3","\tAgree communication channels between the parties in the event of a personal data breach, including nominated points of contact."]
[4.0999999999999996,"Arrangements are in place with joint controllers in the event of a personal data breach.","4.1.4","\tTest breach communication channels and procedures with joint controllers."]
[4.2,"Contracts are in place between the controller and any processors working on their behalf that reflect the processor's obligations in the event of a personal data breach.","4.2.1","\tPut in place contractual agreements with processors that specify how to meet the requirements of article 33 of the UK GDPR and each parties' responsibilities if a personal data breach occurs."]
[{"$f":"A6","v":4.2},"Contracts are in place between the controller and any processors working on their behalf that reflect the processor's obligations in the event of a personal data breach.","4.2.2","\tInclude any agreed arrangements for the processor to report a personal data breach on your behalf."]
[4.2,"Contracts are in place between the controller and any processors working on their behalf that reflect the processor's obligations in the event of a personal data breach.","4.2.3","\tAgree and document timescales for processors to report suspected personal data breaches to you. "]
{"$rows_left_out":2}
{"sheet":"5. Ident, assessment & log","index":9,"n_rows":24,"n_cols":10,"rows_kept":24,"cut":false,"hidden":false,"merged":[[1,1,4,1],[1,0,4,0],[5,1,15,1],[5,0,15,0],[16,1,23,1],[16,0,23,0]]}
["Number","Our expectations","Reference","Ways to meet our expectations","Current status","Reasons for Status","Actions","Action owner","Action Status","Due date\n(DD/MM/YYYY)"]
[5.0999999999999996,"Measures are in place to prevent and detect personal data breaches.","5.1.1","Put in place appropriate organisational measures to prevent personal data breaches, for example: \n- \tinformation security policies and procedures; \n- \trisk assessments; \n- \tinternal audits; \n- \tfraud detection reviews; or\n- \tthird-party notification procedures."]
[{"$f":"A2","v":5.0999999999999996},"Measures are in place to prevent and detect personal data breaches.","5.1.2","Put in place appropriate technical measures to promptly detect personal data breaches, for example: \n- \tdata flow and log analysers;\n- \tintrusion detection systems and intrusion prevention systems or firewalls that can alert to and identify actual personal data breaches; \n- \tdata leakage control; and \n- \taccess logging."]
[5.0999999999999996,"Measures are in place to prevent and detect personal data breaches.","5.1.3","\tEnsure there is an effective process to identify, investigate and respond to any suspected offences under section 170 DPA 18. "]
[5.0999999999999996,"Measures are in place to prevent and detect personal data breaches.","5.1.4","\tEnsure there is a threshold for a reasonable level of certainty\" that a personal data breach has occurred."]
[5.2,"Measures are in place to assess the severity of personal data breaches.","5.2.1","\tRecord the type of personal and special category information held."]
[{"$f":"A6","v":5.2},{"$f":"B6","v":"Measures are in place to assess the severity of personal data breaches."},"5.2.2","\tDocument and put in place criteria to assess the severity of the personal data breach and the likely effect on people's rights and freedoms"]
[5.2,"Measures are in place to assess the severity of personal data breaches.","5.2.3","\tReference guidance (eg ICO's personal data breach criteria). "]
{"$rows_left_out":17}
{"sheet":"6. Reporting processes","index":10,"n_rows":14,"n_cols":10,"rows_kept":14,"cut":false,"hidden":false,"merged":[[1,1,8,1],[1,0,8,0],[9,1,13,1],[9,0,13,0]]}
["Number","Our expectations","Reference","Ways to meet our expectations","Current status","Reasons for Status","Actions","Action owner","Action Status","Due Date\n(DD/MM/YYYY)"]
[6.1,"Procedures are in place to report personal data breaches to the ICO, where required.","6.1.1","\tIdentify and record the lead supervisory authority (for the UK, this is the ICO), particularly if there is potential for a cross-border breach. Include this in your breach response plan."]
[{"$f":"A2","v":6.1},"Procedures are in place to report personal data breaches to the ICO, where required.","6.1.2","\tPut a process in place for reporting personal data breaches to the ICO. "]
[6.1,"Procedures are in place to report personal data breaches to the ICO, where required.","6.1.3","Detail in the report (as a minimum); \n- \tthe nature of the personal data breach; \n- \tthe number of people and records affected; \n- \ta contact point (DPO); \n- \tthe likely consequences; and \n- \tany remedial measures you’ve taken, or will take, to address the effects of the personal data breach."]
[6.1,"Procedures are in place to report personal data breaches to the ICO, where required.","6.1.4","\tReport a personal data breach to the ICO within the required timeframe, if a person's rights and freedoms are affected, or are likely to be."]
[6.1,"Procedures are in place to report personal data breaches to the ICO, where required.","6.1.5","Put fall back procedures in place for: \n- \tout of office hours personal data breaches; \n- \tdecision-maker absences; and \n- \talternative notification routes (eg if a  communication channel has been compromised by the personal data breach)."]
[6.1,"Procedures are in place to report personal data breaches to the ICO, where required.","6.1.6","\tRecord decisions not to report a personal data breach or the reasons for any delays, along with any advice received from the supervisory authority (or other third party)."]
[6.1,"Procedures are in place to report personal data breaches to the ICO, where required.","6.1.7","\tEnsure the DPO is involved in assessing whether to report personal data breaches to the ICO."]
{"$rows_left_out":7}
{"sheet":"7. Feedback & lessons learned","index":11,"n_rows":11,"n_cols":10,"rows_kept":11,"cut":false,"hidden":false,"merged":[[1,0,10,0],[1,1,10,1]]}
["Number","Our expectations","Reference","Ways to meet our expectations","Current Status","Reasons for Status","Actions","Action owner","Action Status","Due Date\n(DD/MM/YYYY)"]
[7.1,"Procedures are in place to investigate personal data breaches and support organisational learning.","7.1.1","\tConduct a formal investigation or root cause analysis (RCA) after a significant personal data breach has occurred."]
[null,null,"7.1.2","\tReport the results of investigations or RCAs to senior or strategic management."]
[null,null,"7.1.3","\tRecord the findings from investigations or RCAs on the risk register, where appropriate, or feed into the information risk process."]
[null,null,"7.1.4","\tPeriodically re-evaluate risks from previous personal data breaches."]
[null,null,"7.1.5","\tPut a methodology in place to capture lessons learned."]
[null,null,"7.1.6","\tIdentify common trends through analysis and reviews of personal data breaches."]
[null,null,"7.1.7","\tPut processes in place to feedback lessons learned to staff and policy reviewers."]
{"$rows_left_out":3}