{"text_format":"1","workbook":"xlsx","n_sheets":14,"sheets":["Introduction","Sheet2","Lookup","1. Info & cyber sec management","2. Asset management","3. Information management ","4. Access control","5. Physical security","6. System & network security","7. Compliance","8. IT supplier relationships","9. Business continuity manageme","10. Change management","11. Information transfer"],"not_rendered":{"charts":6,"images":1,"macros":1,"external_links":0,"defined_names":8,"comments":0,"pivot_tables":0},"unopened":[],"bounds":{"document_bytes":16777216,"sheet_cells":100000,"rows_first":2000,"rows_last":500,"rows_between":2000,"halvings":0,"cell_chars":16384,"cell_head_chars":4096},"cells_cut":0,"cells_raw":0,"read":"whole","date_system":"1900"}

{"sheet":"Introduction","index":0,"n_rows":6,"n_cols":2,"rows_kept":6,"cut":false,"hidden":false,"merged":[[5,1,42,15],[4,1,4,15]]}
[]
[]
[]
[]
[null,"Information & Cyber Security Checklist Tracker"]
[null,"\nYou can use this Tracker to record and track your actions once you have read the checklist. \n\nWe have suggested some columns to help you to build your own action plan and improve your compliance. \n\nKey phrases:\n\nStatus – This refers to whether the suggested action is ’in place', ‘partially in place’, or ‘not in place’. You can also record the status as ‘not applicable’ to your organisation. You can choose the status from a drop-down list.\n\nActions – You can describe what you need to do next to meet the suggested action.\n\nAction Owner(s) – You can specify who is responsible for the action.\n\nAction Status – You can choose what stage the action is at from a drop-down list. \n\nDue Date – You can record when you expect to complete the action.\n\n\n\nThe Data Protection Audit Framework, including the Tracker, is available under the terms of the Open Government Licence v3.0."]

{"sheet":"Sheet2","index":1,"n_rows":27,"n_cols":11,"rows_kept":27,"cut":false,"hidden":true,"merged":[]}
[null,"1. Leadership & Oversight","2. Policies & Procedures","3. DP compliance, monitoring and assurance","4. Contracts with processors","5. Documentation","6. Lawful basis & transparency","7. DP by design & default","8. Risks & DPIAs","9. Individual rights","Total"]
["Fully meeting our expectation",{"$f":"COUNTIF('1. Info & cyber sec management'!#REF!,A2)","v":{"$error":"#REF!"}},{"$f":"COUNTIF('2. Asset management'!E:E,A2)","v":0},{"$f":"COUNTIF('3. Information management '!E:E,A2)","v":0},{"$f":"COUNTIF('4. Access control'!E:E,A2)","v":0},{"$f":"COUNTIF('5. Physical security'!E:E,A2)","v":0},{"$f":"COUNTIF('6. System & network security'!E:E,A2)","v":0},{"$f":"COUNTIF('7. Compliance'!E:E,A2)","v":0},{"$f":"COUNTIF('8. IT supplier relationships'!E:E,A2)","v":0},{"$f":"COUNTIF('9. Business continuity manageme'!E:E,A2)","v":0},{"$f":"SUM(B2:J2)","v":{"$error":"#REF!"}}]
["Partially meeting our expectation",{"$f":"COUNTIF('1. Info & cyber sec management'!#REF!,A3)","v":{"$error":"#REF!"}},{"$f":"COUNTIF('2. Asset management'!E:E,A3)","v":0},{"$f":"COUNTIF('3. Information management '!E:E,A3)","v":0},{"$f":"COUNTIF('4. Access control'!E:E,A3)","v":0},{"$f":"COUNTIF('5. Physical security'!E:E,A3)","v":0},{"$f":"COUNTIF('6. System & network security'!E:E,A3)","v":0},{"$f":"COUNTIF('7. Compliance'!E:E,A3)","v":0},{"$f":"COUNTIF('8. IT supplier relationships'!E:E,A3)","v":0},{"$f":"COUNTIF('9. Business continuity manageme'!E:E,A3)","v":0},{"$f":"SUM(B3:J3)","v":{"$error":"#REF!"}}]
["Not meeting our expectation",{"$f":"COUNTIF('1. Info & cyber sec management'!#REF!,A4)","v":{"$error":"#REF!"}},{"$f":"COUNTIF('2. Asset management'!E:E,A4)","v":0},{"$f":"COUNTIF('3. Information management '!E:E,A4)","v":0},{"$f":"COUNTIF('4. Access control'!E:E,A4)","v":0},{"$f":"COUNTIF('5. Physical security'!E:E,A4)","v":0},{"$f":"COUNTIF('6. System & network security'!E:E,A4)","v":0},{"$f":"COUNTIF('7. Compliance'!E:E,A4)","v":0},{"$f":"COUNTIF('8. IT supplier relationships'!E:E,A4)","v":0},{"$f":"COUNTIF('9. Business continuity manageme'!E:E,A4)","v":0},{"$f":"SUM(B4:J4)","v":{"$error":"#REF!"}}]
["Not Applicable",{"$f":"COUNTIF('1. Info & cyber sec management'!#REF!,A5)","v":{"$error":"#REF!"}},{"$f":"COUNTIF('2. Asset management'!E:E,A5)","v":0},{"$f":"COUNTIF('3. Information management '!E:E,A5)","v":0},{"$f":"COUNTIF('4. Access control'!E:E,A5)","v":0},{"$f":"COUNTIF('5. Physical security'!E:E,A5)","v":0},{"$f":"COUNTIF('6. System & network security'!E:E,A5)","v":0},{"$f":"COUNTIF('7. Compliance'!E:E,A5)","v":0},{"$f":"COUNTIF('8. IT supplier relationships'!E:E,A5)","v":0},{"$f":"COUNTIF('9. Business continuity manageme'!E:E,A5)","v":0},{"$f":"SUM(B5:J5)","v":{"$error":"#REF!"}}]
["Blank",{"$f":"COUNTBLANK('1. Info & cyber sec management'!#REF!)","v":{"$error":"#REF!"}},{"$f":"COUNTBLANK('2. Asset management'!E2:E25)","v":7},{"$f":"COUNTBLANK('3. Information management '!E2:E21)","v":0},{"$f":"COUNTBLANK('4. Access control'!E2:E13)","v":0},{"$f":"COUNTBLANK('5. Physical security'!E2:E9)","v":0},{"$f":"COUNTBLANK('6. System & network security'!E2:E46)","v":0},{"$f":"COUNTBLANK('7. Compliance'!E2:E13)","v":6},{"$f":"COUNTBLANK('8. IT supplier relationships'!E2:E31)","v":13},{"$f":"COUNTBLANK('9. Business continuity manageme'!E2:E18)","v":10},{"$f":"SUM(B6:J6)","v":{"$error":"#REF!"}}]
[]
[]
[]
[]
{"$rows_left_out":18}
{"sheet":"Lookup","index":2,"n_rows":9,"n_cols":10,"rows_kept":9,"cut":false,"hidden":true,"merged":[]}
["Will implement fully",null,null,null,"Not started",null,"Not started",null,null,"In place"]
["Will implement in part",null,null,null,"On track",null,"In progress",null,null,"Partially in place"]
["Not appropriate for my organisation",null,null,null,"Overdue",null,"Overdue",null,null,"Not in place"]
[null,null,null,null,"Completed",null,"Completed",null,null,"Not appropriate for my organisation"]
[]
[]
[]
["2000-01-01"]
[{"$f":"TODAY()","v":"2024-09-24"}]

{"sheet":"1. Info & cyber sec management","index":3,"n_rows":29,"n_cols":10,"rows_kept":29,"cut":false,"hidden":false,"merged":[[1,5,3,5],[4,5,6,5],[7,5,14,5],[1,2,3,2],[7,0,14,0],[7,1,14,1],[7,2,14,2],[1,0,3,0],[1,1,3,1],[4,0,6,0],[4,1,6,1],[23,0,28,0],[23,1,28,1],[23,2,28,2],[23,5,28,5],[15,1,18,1],[15,0,18,0],[15,2,18,2],[15,5,18,5],[19,0,22,0],[19,1,22,1],[19,2,22,2],[19,5,22,5]]}
["Number","Action","Status","Reference","Tasks to consider","Notes","Actions to take","Action Owner","Action Status","Due date\n(DD/MM/YYYY)"]
[1.1000000000000001,"Clearly define information and cyber security roles and segregate responsibilities in an overarching management framework. ",null,"1.1.1","Develop a network of information and cyber security champions across your organisation to support the framework."]
[null,null,null,"1.1.2","Review the framework at appropriate intervals to ensure it remains up-to-date."]
[null,null,null,"1.1.3","Include your Data Protection Officer (DPO) on any relevant information and cyber security committees, boards or forums."]
[1.2000000000000002,"Set out your approach to information and cyber security in a policy framework. ",null,"1.2.1","Create procedures that support and provide direction on certain topics (eg physical security, network security, access control and asset management)."]
[null,null,null,"1.2.2","Create system operating procedures that provide clear guidance on the correct and secure use of software and hardware assets which process personal information."]
[null,null,null,"1.2.3","Ask staff to confirm they have read and understood key policies and procedures"]
[1.3,"Incorporate information and cyber security within a formal training programme. ",null,"1.3.1","Do a training needs assessment to understand at a role level what training your staff require, taking into account the information you process and the risks to security."]
[null,null,null,"1.3.2","Include information security in the induction process and refresh the training on a regular basis."]
[null,null,null,"1.3.3","Provide specialist training, where applicable. "]
{"$rows_left_out":20}
{"sheet":"2. Asset management","index":4,"n_rows":18,"n_cols":10,"rows_kept":18,"cut":false,"hidden":false,"merged":[[10,2,17,2],[10,0,17,0],[10,1,17,1],[10,5,17,5],[1,0,9,0],[1,1,9,1],[1,2,9,2],[1,5,9,5]]}
["Number","Action","Status","Reference","Tasks to consider","Notes","Actions to take","Action Owner","Action Status","Due date\n(DD/MM/YYYY)"]
[2.1,"Identify, classify and risk assess all your hardware and software assets.",null,"2.1.1","Conduct periodic physical checks (floor to book exercises) to ensure the accuracy of the hardware asset inventory."]
[null,null,null,"2.1.2","Use asset discovery tools to help you identify all assets within the network."]
[null,null,null,"2.1.3","Put processes in place to capture new assets you acquire."]
[null,null,null,"2.1.4","Assign ownership for each individual asset."]
[null,null,null,"2.1.5","Apply appropriate security classifications based on the sensitivity of the information you are processing."]
[null,null,null,"2.1.6","Keep records to show that you review both the inventories themselves and the risks associated with the assets on a periodic basis. "]
[null,null,null,"2.1.7","Train owners on how to risk assess hardware and software assets."]
[null,null,null,"2.1.8","Create a checklist for staff to follow when they review asset inventories. "]
[null,null,null,"2.1.9","Identify your critical assets and suppliers and any interdependencies."]
{"$rows_left_out":9}
{"sheet":"3. Information management ","index":5,"n_rows":40,"n_cols":10,"rows_kept":40,"cut":false,"hidden":false,"merged":[[1,2,10,2],[1,1,10,1],[1,0,10,0],[1,5,10,5],[11,2,15,2],[11,1,15,1],[11,0,15,0],[11,5,15,5],[16,0,19,0],[16,1,19,1],[16,2,19,2],[16,5,19,5],[34,0,39,0],[34,1,39,1],[34,2,39,2],[34,5,39,5],[20,2,23,2],[20,5,23,5],[24,0,33,0],[24,1,33,1],[24,2,33,2],[24,5,33,5],[20,1,23,1],[20,0,23,0]]}
["Number","Action","Status","Reference","Tasks to consider","Notes","Actions to take","Action Owner","Action Status","Due date\n(DD/MM/YYYY)"]
[3.1,"Assign appropriate security classifications to your information and label your information to reflect your agreed information classification scheme.",null,"3.1.1","Take into account the requirements of confidentiality, integrity and availability of personal information when you assign classifications. "]
[null,null,null,"3.1.2","Document security classifications within an applicable policy that you communicate to all staff."]
[null,null,null,"3.1.3","Assign accountability for classifications to Information Asset Owners. "]
[null,null,null,"3.1.4","Review classifications to ensure they remain appropriate and keep a record of reviews."]
[null,null,null,"3.1.5","Conduct dip sampling to check whether you apply security classifications appropriately and feed results back to staff."]
[null,null,null,"3.1.6","Provide detailed guidance for staff on how to assign security classifications, including examples."]
[null,null,null,"3.1.7","Implement a procedure for information labelling that covers both physical and electronic information."]
[null,null,null,"3.1.8","Ensure electronic information records sufficient metadata that helps to identify, manage and control personal information."]
[null,null,null,"3.1.9","Provide training to staff on how to correctly label information."]
{"$rows_left_out":31}
{"sheet":"4. Access control","index":6,"n_rows":37,"n_cols":10,"rows_kept":37,"cut":false,"hidden":false,"merged":[[21,0,28,0],[21,1,28,1],[21,2,28,2],[21,5,28,5],[29,0,36,0],[29,1,36,1],[29,2,36,2],[29,5,36,5],[15,0,16,0],[15,1,16,1],[15,2,16,2],[15,5,16,5],[17,0,20,0],[17,1,20,1],[17,2,20,2],[17,5,20,5],[1,0,6,0],[1,1,6,1],[1,2,6,2],[1,5,6,5],[7,0,14,0],[7,1,14,1],[7,2,14,2],[7,5,14,5]]}
["Number","Action","Status","Reference","Tasks to consider","Notes","Actions to take","Action Owner","Action Status","Due date\n(DD/MM/YYYY)"]
[4.0999999999999996,"Assign appropriate access rights to staff for processing personal information",null,"4.1.1","Carry out background checks on new staff prior to employment (including direct employees, temporary staff and contractors), when it is applicable to their role and responsibilities."]
[null,null,null,"4.1.2","Document in policy how you grant access rights to new starters."]
[null,null,null,"4.1.3","Assess and document the requirements of each role to assign the correct access rights."]
[null,null,null,"4.1.4","Document the process for granting access for temporary and contract staff."]
[null,null,null,"4.1.5","Create role-based access profiles based on the requirement of each role. "]
[null,null,null,"4.1.6","Use security classifications to assess which roles should have access to certain types of information."]
[4.2,"Restrict access to sensitive confidential information or systems to roles which you have formally assessed as requiring privileged or higher level access. ",null,"4.2.1","Document the process for assessing and assigning privileged access. "]
[null,null,null,"4.2.2","Assign responsibility for granting privileged access to a senior member of staff. "]
[null,null,null,"4.2.3","Maintain a list of all staff with privileged and administrator access. "]
{"$rows_left_out":28}
{"sheet":"5. Physical security","index":7,"n_rows":23,"n_cols":10,"rows_kept":23,"cut":false,"hidden":false,"merged":[[12,0,18,0],[12,1,18,1],[12,2,18,2],[12,5,18,5],[19,0,22,0],[19,1,22,1],[19,2,22,2],[19,5,22,5],[1,0,7,0],[1,1,7,1],[1,2,7,2],[1,5,7,5],[8,0,11,0],[8,1,11,1],[8,2,11,2],[8,5,11,5]]}
["Number","Action","Status","Reference","Tasks to consider","Notes","Actions to take","Action Owner","Action Status","Due date\n(DD/MM/YYYY)"]
[5.0999999999999996,"Protect entry points using appropriate physical controls that mitigate the risk of unauthorised access to secure areas where you are processing personal and special category information.",null,"5.1.1","Identify and risk assess areas that may require an increased level of security. "]
[null,null,null,"5.1.2","Regularly test physical controls to gain assurances of their effectiveness."]
[null,null,null,"5.1.3","Ensure entry points include a mixture of controls to maximise security (eg perimeter security and electronic access control systems)."]
[null,null,null,"5.1.4","Keep a record of the physical access rights assigned to staff. "]
[null,null,null,"5.1.5","Monitor the granting of visitor and guest access."]
[null,null,null,"5.1.6","Include the removal of physical access rights in the leavers’ checklist. "]
[null,null,null,"5.1.7","Audit the record of physical access rights to ensure you revoke access when you should."]
[5.2,"Implement controls to protect against external threats in secure areas, such as server rooms. ",null,"5.2.1","Conduct risk assessments of secure areas and the equipment in them."]
[null,null,null,"5.2.2","Implement controls such as fire detection and suppression systems, humidity sensors and physical access detection systems."]
{"$rows_left_out":14}
{"sheet":"6. System & network security","index":8,"n_rows":76,"n_cols":10,"rows_kept":76,"cut":false,"hidden":false,"merged":[[71,0,75,0],[71,1,75,1],[71,2,75,2],[71,5,75,5],[62,0,66,0],[62,1,66,1],[62,2,66,2],[62,5,66,5],[67,0,70,0],[67,1,70,1],[67,2,70,2],[67,5,70,5],[50,0,55,0],[50,1,55,1],[50,2,55,2],[50,5,55,5],[56,0,61,0],[56,1,61,1],[56,2,61,2],[56,5,61,5],[34,0,40,0],[34,1,40,1],[34,2,40,2],[34,5,40,5],[41,0,49,0],[41,1,49,1],[41,2,49,2],[41,5,49,5],[19,0,22,0],[19,1,22,1],[19,2,22,2],[19,5,22,5],[23,0,33,0],[23,1,33,1],[23,2,33,2],[23,5,33,5],[12,0,14,0],[12,1,14,1],[12,2,14,2],[12,5,14,5],[15,0,18,0],[15,1,18,1],[15,2,18,2],[15,5,18,5],[1,0,5,0],[1,1,5,1],[1,2,5,2],[1,5,5,5],[6,0,11,0],[6,1,11,1],[6,2,11,2],[6,5,11,5]]}
["Number","Action","Status","Reference","Tasks to consider","Notes","Actions to take","Action Owner","Action Status","Due date\n(DD/MM/YYYY)"]
[6.1,"Establish and apply a secure baseline across your organisations information technology (IT) infrastructure. ",null,"6.1.1","Establish and define baseline configurations for all endpoints, systems, network devices, cloud services and applications. "]
[null,null,null,"6.1.2","Keep all baseline configurations under periodic review."]
[null,null,null,"6.1.3","Implement processes and utilising tools that assist in enforcing baseline configurations. "]
[null,null,null,"6.1.4","Implement procedures to ensure you control any modification to baseline configurations. "]
[null,null,null,"6.1.5","Document roles and responsibilities for applying and modifying baseline configurations."]
[6.2,"Use appropriate anti-virus and anti-malware software and keep it up-to-date.",null,"6.2.1","Conduct risk assessments to determine which anti-virus and anti-malware software is most suitable to your organisation."]
[null,null,null,"6.2.2","Keep records to demonstrate you’ve installed anti-virus and anti-malware software. "]
[null,null,null,"6.2.3","Schedule regular anti-virus and anti-malware software scans and checks of systems."]
[null,null,null,"6.2.4","Keep anti-virus and anti-malware software up-to-date and install patches as soon as possible. "]
{"$rows_left_out":67}
{"sheet":"7. Compliance","index":9,"n_rows":7,"n_cols":10,"rows_kept":7,"cut":false,"hidden":false,"merged":[[1,0,3,0],[1,1,3,1],[1,2,3,2],[1,5,3,5],[4,0,6,0],[4,1,6,1],[4,2,6,2],[4,5,6,5]]}
["Number","Action","Status","Reference","Tasks to consider","Notes","Actions to take","Action Owner","Action Status","Due date\n(DD/MM/YYYY)"]
[7.1,"Plan and undertake internal reviews to ensure that you implement information and cyber security controls in line with organisational policies and procedures.",null,"7.1.1","Conduct independent internal reviews of information and cyber security controls, including audits and IT health checks (ITHC). "]
[null,null,null,"7.1.2","Develop an action plan for treating any identified issues and risks and recording risks on any relevant risk registers. "]
[null,null,null,"7.1.3","Ensure management undertake compliance reviews, such as spot checks and staff surveys, within their areas of responsibility."]
[7.2,"Commission external information and cyber security reviews to ensure you are implementing effective information and cyber security controls.",null,"7.2.1","Plan and commission external compliance reviews of key systems, including vulnerability assessments, pen testing and audits."]
[null,null,null,"7.2.2","Develop an action plan for treating any identified issues and risks and record risks on any relevant risk registers. "]
[null,null,null,"7.2.3","Obtain certification from industry standards, such as ISO27001/2 and Cyber Essentials Plus."]

{"sheet":"8. IT supplier relationships","index":10,"n_rows":18,"n_cols":10,"rows_kept":18,"cut":false,"hidden":false,"merged":[[10,0,17,0],[10,1,17,1],[10,2,17,2],[10,5,17,5],[1,0,4,0],[1,1,4,1],[1,2,4,2],[1,5,4,5],[5,0,9,0],[5,1,9,1],[5,2,9,2],[5,5,9,5]]}
["Number","Action","Status","Reference","Tasks to consider","Notes","Actions to take","Action Owner","Action Status","Due date\n(DD/MM/YYYY)"]
[8.1,"Carry out information and cyber security risk assessments and due diligence checks to understand and mitigate risks prior to granting IT suppliers access to your organisation's networks and assets. ",null,"8.1.1","Complete risk assessments prior to procuring services. "]
[null,null,null,"8.1.2","Conduct due diligence checks."]
[null,null,null,"8.1.3","Group suppliers into different categories based on the nature of the service they provide."]
[null,null,null,"8.1.4","Assign risk profiles to each group, taking into account the: \n- sensitivity of the personal information processed; \n- capability of likely threats; and \n- impact on operations of any loss, damage or disruption."]
[8.1999999999999993,"Ensure contracts and agreements are in place with IT suppliers, and that they include relevant information and cyber security requirements.",null,"8.2.1","Ensure contracts and agreements are signed by all parties. "]
[null,null,null,"8.2.2","Include appropriate information and cyber security requirements or clauses in contracts and ensure they are enforceable under the contract."]
[null,null,null,"8.2.3","Conduct audits or reviews of information and cyber security arrangements on a periodic basis. "]
[null,null,null,"8.2.4","Keep a centralised log of all contracts and agreements to facilitate an easily review when required."]
[null,null,null,"8.2.5","Dip sample current contracts to check they are valid, up-to-date and include correct security requirements."]
{"$rows_left_out":9}
{"sheet":"9. Business continuity manageme","index":11,"n_rows":8,"n_cols":10,"rows_kept":8,"cut":false,"hidden":false,"merged":[[1,0,7,0],[1,1,7,1],[1,2,7,2],[1,5,7,5]]}
["Number","Action","Status","Reference","Tasks to consider","Notes","Actions to take","Action Owner","Action Status","Due date\n(DD/MM/YYYY)"]
[9.1,"Have business continuity and disaster recovery plans in place so you can take appropriate and timely actions to protect personal information from further loss of confidentiality, integrity or availability.",null,"9.1.1","Formally document plans for business continuity and disaster recovery."]
[null,null,null,"9.1.2","Periodically review, test and update plans. "]
[null,null,null,"9.1.3","Ask senior staff to authorise the plans. "]
[null,null,null,"9.1.4","Define and document roles and responsibilities for staff involved in business continuity and disaster recovery."]
[null,null,null,"9.1.5","Train all staff on what to do in the event of a systems or network outage."]
[null,null,null,"9.1.6","Test business continuity and disaster recovery plans to ensure they remain up-to-date and fit for purpose."]
[null,null,null,"9.1.7","Conduct lessons learned activities to identify and understand any changes you need to make to the plans."]

{"sheet":"10. Change management","index":12,"n_rows":20,"n_cols":10,"rows_kept":20,"cut":false,"hidden":false,"merged":[[5,2,12,2],[5,5,12,5],[13,0,19,0],[13,1,19,1],[13,2,19,2],[13,5,19,5],[1,0,4,0],[1,1,4,1],[1,2,4,2],[1,5,4,5],[5,0,12,0],[5,1,12,1]]}
["Number","Action","Status","Reference","Tasks to consider","Notes","Actions to take","Action Owner","Action Status","Due date\n(DD/MM/YYYY)"]
[10.1,"Assess potential information and cyber security risks before you make a change to your existing processes, assets or systems. ",null,"10.1.1","Identify information and cyber security requirements for all types of changes, not only ICT development projects. "]
[null,null,null,"10.1.2","Take steps to address the risks at an early stage. "]
[null,null,null,"10.1.3","Review risks and steps taken at predefined stages and throughout the change process. "]
[null,null,null,"10.1.4","Allocate responsibility for information and cyber security risks to someone who is involved in the project."]
[10.199999999999999,"Assess potential information and cyber security risks before procuring or developing new systems or applications. ",null,"10.2.1","Document your approach to the secure development and acquisition of new applications and systems. "]
[null,null,null,"10.2.2","Establish and apply a minimum secure baseline for their development and acquisition. "]
[null,null,null,"10.2.3","Implement security testing during the development life cycle and through the acquisition process."]
[null,null,null,"10.2.4","Assign responsibility for directing, monitoring and reviewing the outsourced system development. "]
[null,null,null,"10.2.5","Separate development, testing and production environments. "]
{"$rows_left_out":11}
{"sheet":"11. Information transfer","index":13,"n_rows":10,"n_cols":10,"rows_kept":10,"cut":false,"hidden":false,"merged":[[5,0,9,0],[5,1,9,1],[5,2,9,2],[5,5,9,5],[1,0,4,0],[1,1,4,1],[1,2,4,2],[1,5,4,5]]}
["Number","Action","Status","Reference","Tasks to consider","Notes","Actions to take","Action Owner","Action Status","Due date\n(DD/MM/YYYY)"]
[11.1,"Protect personal information when you are transferring it and prevent it being inappropriately disclosed.",null,"11.1.1","Implement information transfer policies and procedures for  transferring personal information electronically and manually. "]
[null,null,null,"11.1.2","Communicate these policies and procedures to relevant staff. "]
[null,null,null,"11.1.3","Include data transfer security requirements in contracts or transfer agreements with third parties. "]
[null,null,null,"11.1.4","Complete a lessons learned exercise in the event of a personal data breach, update policies and procedures and provide further training, where required."]
[11.2,"Protect incoming and outgoing communications using appropriate security measures. ",null,"11.2.1","Use encryption to protect the content of emails and their attachments, especially if they contain sensitive personal information. "]
[null,null,null,"11.2.2","Use spam filters and various malware detection techniques to protect against receiving malicious emails."]
[null,null,null,"11.2.3","Automatically quarantine outgoing emails containing sensitive information."]
[null,null,null,"11.2.4","Provide social engineering training to staff, covering the different types of techniques that can be used."]
[null,null,null,"11.2.5","Conduct phishing tests on staff and feedback on the results. "]